[PATCH v3 0/9] memory: assert and define MemoryRegionOps callbacks

P J P posted 9 patches 1 week ago
Test FreeBSD passed
Test docker-quick@centos7 failed
Test checkpatch passed
Test docker-mingw@fedora passed
Patches applied successfully (tree, apply log)
git fetch https://github.com/patchew-project/qemu tags/patchew/20200630122710.1119158-1-ppandit@redhat.com
Maintainers: Peter Maydell <peter.maydell@linaro.org>, David Gibson <david@gibson.dropbear.id.au>, Paolo Bonzini <pbonzini@redhat.com>, Alex Williamson <alex.williamson@redhat.com>, Andrey Smirnov <andrew.smirnov@gmail.com>, "Hervé Poussineau" <hpoussin@reactos.org>, Joel Stanley <joel@jms.id.au>
hw/misc/imx7_ccm.c       |  7 +++++++
hw/misc/tz-ppc.c         | 14 ++++++++++++++
hw/nvram/nrf51_nvm.c     |  5 +++++
hw/pci-host/designware.c |  9 +++++++++
hw/pci-host/prep.c       |  8 ++++++++
hw/ppc/prep_systemio.c   |  8 ++++++++
hw/ppc/spapr_pci.c       | 13 +++++++++++--
hw/vfio/pci-quirks.c     |  8 ++++++++
memory.c                 | 10 +++++++++-
9 files changed, 79 insertions(+), 3 deletions(-)

[PATCH v3 0/9] memory: assert and define MemoryRegionOps callbacks

Posted by P J P 1 week ago
From: Prasad J Pandit <pjp@fedoraproject.org>

Hello,

* This series asserts that MemoryRegionOps objects define read/write
  callback methods. Thus avoids potential NULL pointer dereference.
  ex. -> https://git.qemu.org/?p=qemu.git;a=commit;h=bb15013ef34617eb1344f5276292cadd326c21b2

* Also adds various undefined MemoryRegionOps read/write functions
  to avoid potential assert failure.

Thank you.
--
Prasad J Pandit (9):
  hw/pci-host: add pci-intack write method
  pci-host: add pcie-msi read method
  vfio: add quirk device write method
  prep: add ppc-parity write method
  nvram: add nrf51_soc flash read method
  spapr_pci: add spapr msi read method
  tz-ppc: add dummy read/write methods
  imx7-ccm: add digprog mmio write method
  memory: assert MemoryRegionOps callbacks are defined

 hw/misc/imx7_ccm.c       |  7 +++++++
 hw/misc/tz-ppc.c         | 14 ++++++++++++++
 hw/nvram/nrf51_nvm.c     |  5 +++++
 hw/pci-host/designware.c |  9 +++++++++
 hw/pci-host/prep.c       |  8 ++++++++
 hw/ppc/prep_systemio.c   |  8 ++++++++
 hw/ppc/spapr_pci.c       | 13 +++++++++++--
 hw/vfio/pci-quirks.c     |  8 ++++++++
 memory.c                 | 10 +++++++++-
 9 files changed, 79 insertions(+), 3 deletions(-)

-- 
2.26.2


Re: [PATCH v3 0/9] memory: assert and define MemoryRegionOps callbacks

Posted by no-reply@patchew.org 1 week ago
Patchew URL: https://patchew.org/QEMU/20200630122710.1119158-1-ppandit@redhat.com/



Hi,

This series failed the docker-quick@centos7 build test. Please find the testing commands and
their output below. If you have Docker installed, you can probably reproduce it
locally.

=== TEST SCRIPT BEGIN ===
#!/bin/bash
make docker-image-centos7 V=1 NETWORK=1
time make docker-test-quick@centos7 SHOW_ENV=1 J=14 NETWORK=1
=== TEST SCRIPT END ===

socket_accept failed: Resource temporarily unavailable
socket_accept failed: Resource temporarily unavailable
**
ERROR:/tmp/qemu-test/src/tests/qtest/libqtest.c:301:qtest_init_without_qmp_handshake: assertion failed: (s->fd >= 0 && s->qmp_fd >= 0)
**
ERROR:/tmp/qemu-test/src/tests/qtest/libqtest.c:301:qtest_init_without_qmp_handshake: assertion failed: (s->fd >= 0 && s->qmp_fd >= 0)
/tmp/qemu-test/src/tests/qtest/libqtest.c:175: kill_qemu() detected QEMU death from signal 6 (Aborted) (core dumped)
ERROR - Bail out! ERROR:/tmp/qemu-test/src/tests/qtest/libqtest.c:301:qtest_init_without_qmp_handshake: assertion failed: (s->fd >= 0 && s->qmp_fd >= 0)
ERROR - Bail out! ERROR:/tmp/qemu-test/src/tests/qtest/libqtest.c:301:qtest_init_without_qmp_handshake: assertion failed: (s->fd >= 0 && s->qmp_fd >= 0)
/tmp/qemu-test/src/tests/qtest/libqtest.c:175: kill_qemu() detected QEMU death from signal 6 (Aborted) (core dumped)
  TEST    check-unit: tests/test-write-threshold
make: *** [check-qtest-x86_64] Error 1
make: *** Waiting for unfinished jobs....
make: *** [check-qtest-aarch64] Error 1
  TEST    check-unit: tests/test-crypto-hash
  TEST    iotest-qcow2: 025
  TEST    check-unit: tests/test-crypto-hmac
---
+++ /tmp/qemu-test/build/tests/qemu-iotests/030.out.bad 2020-06-30 13:01:58.920205719 +0000
@@ -1,5 +1,552 @@
-...........................
+WARNING:qemu.machine:qemu received signal 6: /tmp/qemu-test/build/tests/qemu-iotests/../../x86_64-softmmu/qemu-system-x86_64 -display none -vga none -chardev socket,id=mon,path=/tmp/tmp.6XQrnYb2wb/qemu-15849-monitor.sock -mon chardev=mon,mode=control -qtest unix:path=/tmp/tmp.6XQrnYb2wb/qemu-15849-qtest.sock -accel qtest -nodefaults -display none -accel qtest -drive if=virtio,id=drive0,file=/tmp/qemu-test/test.img,format=qcow2,cache=writeback,aio=threads
+WARNING:qemu.machine:qemu received signal 6: /tmp/qemu-test/build/tests/qemu-iotests/../../x86_64-softmmu/qemu-system-x86_64 -display none -vga none -chardev socket,id=mon,path=/tmp/tmp.6XQrnYb2wb/qemu-15849-monitor.sock -mon chardev=mon,mode=control -qtest unix:path=/tmp/tmp.6XQrnYb2wb/qemu-15849-qtest.sock -accel qtest -nodefaults -display none -accel qtest -drive if=virtio,id=drive0,file=/tmp/qemu-test/test.img,format=qcow2,cache=writeback,aio=threads
+WARNING:qemu.machine:qemu received signal 6: /tmp/qemu-test/build/tests/qemu-iotests/../../x86_64-softmmu/qemu-system-x86_64 -display none -vga none -chardev socket,id=mon,path=/tmp/tmp.6XQrnYb2wb/qemu-15849-monitor.sock -mon chardev=mon,mode=control -qtest unix:path=/tmp/tmp.6XQrnYb2wb/qemu-15849-qtest.sock -accel qtest -nodefaults -display none -accel qtest -drive if=virtio,id=drive0,file=/tmp/qemu-test/test.img,format=qcow2,cache=writeback,aio=threads
+WARNING:qemu.machine:qemu received signal 6: /tmp/qemu-test/build/tests/qemu-iotests/../../x86_64-softmmu/qemu-system-x86_64 -display none -vga none -chardev socket,id=mon,path=/tmp/tmp.6XQrnYb2wb/qemu-15849-monitor.sock -mon chardev=mon,mode=control -qtest unix:path=/tmp/tmp.6XQrnYb2wb/qemu-15849-qtest.sock -accel qtest -nodefaults -display none -accel qtest -drive if=virtio,id=drive0,file=/tmp/qemu-test/test.img,format=qcow2,cache=writeback,aio=threads
+WARNING:qemu.machine:qemu received signal 6: /tmp/qemu-test/build/tests/qemu-iotests/../../x86_64-softmmu/qemu-system-x86_64 -display none -vga none -chardev socket,id=mon,path=/tmp/tmp.6XQrnYb2wb/qemu-15849-monitor.sock -mon chardev=mon,mode=control -qtest unix:path=/tmp/tmp.6XQrnYb2wb/qemu-15849-qtest.sock -accel qtest -nodefaults -display none -accel qtest -drive if=virtio,id=drive0,file=/tmp/qemu-test/test.img,format=qcow2,cache=writeback,aio=threads
+WARNING:qemu.machine:qemu received signal 6: /tmp/qemu-test/build/tests/qemu-iotests/../../x86_64-softmmu/qemu-system-x86_64 -display none -vga none -chardev socket,id=mon,path=/tmp/tmp.6XQrnYb2wb/qemu-15849-monitor.sock -mon chardev=mon,mode=control -qtest unix:path=/tmp/tmp.6XQrnYb2wb/qemu-15849-qtest.sock -accel qtest -nodefaults -display none -accel qtest -drive if=virtio,id=drive0,file=/tmp/qemu-test/img-8.img,format=qcow2,cache=writeback,aio=threads,backing.backing.backing.backing.backing.backing.backing.backing.node-name=node0,backing.backing.backing.backing.backing.backing.backing.node-name=node1,backing.backing.backing.backing.backing.backing.node-name=node2,backing.backing.backing.backing.backing.node-name=node3,backing.backing.backing.backing.node-name=node4,backing.backing.backing.node-name=node5,backing.backing.node-name=node6,backing.node-name=node7,node-name=node8
+WARNING:qemu.machine:qemu received signal 6: /tmp/qemu-test/build/tests/qemu-iotests/../../x86_64-softmmu/qemu-system-x86_64 -display none -vga none -chardev socket,id=mon,path=/tmp/tmp.6XQrnYb2wb/qemu-15849-monitor.sock -mon chardev=mon,mode=control -qtest unix:path=/tmp/tmp.6XQrnYb2wb/qemu-15849-qtest.sock -accel qtest -nodefaults -display none -accel qtest -drive if=virtio,id=drive0,file=/tmp/qemu-test/img-8.img,format=qcow2,cache=writeback,aio=threads,backing.backing.backing.backing.backing.backing.backing.backing.node-name=node0,backing.backing.backing.backing.backing.backing.backing.node-name=node1,backing.backing.backing.backing.backing.backing.node-name=node2,backing.backing.backing.backing.backing.node-name=node3,backing.backing.backing.backing.node-name=node4,backing.backing.backing.node-name=node5,backing.backing.node-name=node6,backing.node-name=node7,node-name=node8
+WARNING:qemu.machine:qemu received signal 6: /tmp/qemu-test/build/tests/qemu-iotests/../../x86_64-softmmu/qemu-system-x86_64 -display none -vga none -chardev socket,id=mon,path=/tmp/tmp.6XQrnYb2wb/qemu-15849-monitor.sock -mon chardev=mon,mode=control -qtest unix:path=/tmp/tmp.6XQrnYb2wb/qemu-15849-qtest.sock -accel qtest -nodefaults -display none -accel qtest -drive if=virtio,id=drive0,file=/tmp/qemu-test/img-8.img,format=qcow2,cache=writeback,aio=threads,backing.backing.backing.backing.backing.backing.backing.backing.node-name=node0,backing.backing.backing.backing.backing.backing.backing.node-name=node1,backing.backing.backing.backing.backing.backing.node-name=node2,backing.backing.backing.backing.backing.node-name=node3,backing.backing.backing.backing.node-name=node4,backing.backing.backing.node-name=node5,backing.backing.node-name=node6,backing.node-name=node7,node-name=node8
+WARNING:qemu.machine:qemu received signal 6: /tmp/qemu-test/build/tests/qemu-iotests/../../x86_64-softmmu/qemu-system-x86_64 -display none -vga none -chardev socket,id=mon,path=/tmp/tmp.6XQrnYb2wb/qemu-15849-monitor.sock -mon chardev=mon,mode=control -qtest unix:path=/tmp/tmp.6XQrnYb2wb/qemu-15849-qtest.sock -accel qtest -nodefaults -display none -accel qtest -drive if=virtio,id=drive0,file=/tmp/qemu-test/img-8.img,format=qcow2,cache=writeback,aio=threads,backing.backing.backing.backing.backing.backing.backing.backing.node-name=node0,backing.backing.backing.backing.backing.backing.backing.node-name=node1,backing.backing.backing.backing.backing.backing.node-name=node2,backing.backing.backing.backing.backing.node-name=node3,backing.backing.backing.backing.node-name=node4,backing.backing.backing.node-name=node5,backing.backing.node-name=node6,backing.node-name=node7,node-name=node8
+WARNING:qemu.machine:qemu received signal 6: /tmp/qemu-test/build/tests/qemu-iotests/../../x86_64-softmmu/qemu-system-x86_64 -display none -vga none -chardev socket,id=mon,path=/tmp/tmp.6XQrnYb2wb/qemu-15849-monitor.sock -mon chardev=mon,mode=control -qtest unix:path=/tmp/tmp.6XQrnYb2wb/qemu-15849-qtest.sock -accel qtest -nodefaults -display none -accel qtest -drive if=virtio,id=drive0,file=/tmp/qemu-test/img-8.img,format=qcow2,cache=writeback,aio=threads,backing.backing.backing.backing.backing.backing.backing.backing.node-name=node0,backing.backing.backing.backing.backing.backing.backing.node-name=node1,backing.backing.backing.backing.backing.backing.node-name=node2,backing.backing.backing.backing.backing.node-name=node3,backing.backing.backing.backing.node-name=node4,backing.backing.backing.node-name=node5,backing.backing.node-name=node6,backing.node-name=node7,node-name=node8
+WARNING:qemu.machine:qemu received signal 6: /tmp/qemu-test/build/tests/qemu-iotests/../../x86_64-softmmu/qemu-system-x86_64 -display none -vga none -chardev socket,id=mon,path=/tmp/tmp.6XQrnYb2wb/qemu-15849-monitor.sock -mon chardev=mon,mode=control -qtest unix:path=/tmp/tmp.6XQrnYb2wb/qemu-15849-qtest.sock -accel qtest -nodefaults -display none -accel qtest -drive if=virtio,id=drive0,file=/tmp/qemu-test/img-8.img,format=qcow2,cache=writeback,aio=threads,backing.backing.backing.backing.backing.backing.backing.backing.node-name=node0,backing.backing.backing.backing.backing.backing.backing.node-name=node1,backing.backing.backing.backing.backing.backing.node-name=node2,backing.backing.backing.backing.backing.node-name=node3,backing.backing.backing.backing.node-name=node4,backing.backing.backing.node-name=node5,backing.backing.node-name=node6,backing.node-name=node7,node-name=node8
+WARNING:qemu.machine:qemu received signal 6: /tmp/qemu-test/build/tests/qemu-iotests/../../x86_64-softmmu/qemu-system-x86_64 -display none -vga none -chardev socket,id=mon,path=/tmp/tmp.6XQrnYb2wb/qemu-15849-monitor.sock -mon chardev=mon,mode=control -qtest unix:path=/tmp/tmp.6XQrnYb2wb/qemu-15849-qtest.sock -accel qtest -nodefaults -display none -accel qtest -drive if=virtio,id=drive0,file=/tmp/qemu-test/img-8.img,format=qcow2,cache=writeback,aio=threads,backing.backing.backing.backing.backing.backing.backing.backing.node-name=node0,backing.backing.backing.backing.backing.backing.backing.node-name=node1,backing.backing.backing.backing.backing.backing.node-name=node2,backing.backing.backing.backing.backing.node-name=node3,backing.backing.backing.backing.node-name=node4,backing.backing.backing.node-name=node5,backing.backing.node-name=node6,backing.node-name=node7,node-name=node8
+WARNING:qemu.machine:qemu received signal 6: /tmp/qemu-test/build/tests/qemu-iotests/../../x86_64-softmmu/qemu-system-x86_64 -display none -vga none -chardev socket,id=mon,path=/tmp/tmp.6XQrnYb2wb/qemu-15849-monitor.sock -mon chardev=mon,mode=control -qtest unix:path=/tmp/tmp.6XQrnYb2wb/qemu-15849-qtest.sock -accel qtest -nodefaults -display none -accel qtest -drive if=virtio,id=drive0,file=/tmp/qemu-test/img-8.img,format=qcow2,cache=writeback,aio=threads,backing.backing.backing.backing.backing.backing.backing.backing.node-name=node0,backing.backing.backing.backing.backing.backing.backing.node-name=node1,backing.backing.backing.backing.backing.backing.node-name=node2,backing.backing.backing.backing.backing.node-name=node3,backing.backing.backing.backing.node-name=node4,backing.backing.backing.node-name=node5,backing.backing.node-name=node6,backing.node-name=node7,node-name=node8
+WARNING:qemu.machine:qemu received signal 6: /tmp/qemu-test/build/tests/qemu-iotests/../../x86_64-softmmu/qemu-system-x86_64 -display none -vga none -chardev socket,id=mon,path=/tmp/tmp.6XQrnYb2wb/qemu-15849-monitor.sock -mon chardev=mon,mode=control -qtest unix:path=/tmp/tmp.6XQrnYb2wb/qemu-15849-qtest.sock -accel qtest -nodefaults -display none -accel qtest -drive if=virtio,id=drive0,file=/tmp/qemu-test/img-8.img,format=qcow2,cache=writeback,aio=threads,backing.backing.backing.backing.backing.backing.backing.backing.node-name=node0,backing.backing.backing.backing.backing.backing.backing.node-name=node1,backing.backing.backing.backing.backing.backing.node-name=node2,backing.backing.backing.backing.backing.node-name=node3,backing.backing.backing.backing.node-name=node4,backing.backing.backing.node-name=node5,backing.backing.node-name=node6,backing.node-name=node7,node-name=node8
+qemu received signal 6: /tmp/qemu-test/build/tests/qemu-iotests/../../x86_64-softmmu/qemu-system-x86_64 -nodefaults -display none -accel qtest -drive format=help
+WARNING:qemu.machine:qemu received signal 6: /tmp/qemu-test/build/tests/qemu-iotests/../../x86_64-softmmu/qemu-system-x86_64 -display none -vga none -chardev socket,id=mon,path=/tmp/tmp.6XQrnYb2wb/qemu-15849-monitor.sock -mon chardev=mon,mode=control -qtest unix:path=/tmp/tmp.6XQrnYb2wb/qemu-15849-qtest.sock -accel qtest -nodefaults -display none -accel qtest -drive if=virtio,id=drive0,file=blkdebug::/tmp/qemu-test/test.img,format=qcow2,cache=writeback,aio=threads
+WARNING:qemu.machine:qemu received signal 6: /tmp/qemu-test/build/tests/qemu-iotests/../../x86_64-softmmu/qemu-system-x86_64 -display none -vga none -chardev socket,id=mon,path=/tmp/tmp.6XQrnYb2wb/qemu-15849-monitor.sock -mon chardev=mon,mode=control -qtest unix:path=/tmp/tmp.6XQrnYb2wb/qemu-15849-qtest.sock -accel qtest -nodefaults -display none -accel qtest -drive if=virtio,id=drive0,file=blkdebug::/tmp/qemu-test/test.img,format=qcow2,cache=writeback,aio=threads
+WARNING:qemu.machine:qemu received signal 6: /tmp/qemu-test/build/tests/qemu-iotests/../../x86_64-softmmu/qemu-system-x86_64 -display none -vga none -chardev socket,id=mon,path=/tmp/tmp.6XQrnYb2wb/qemu-15849-monitor.sock -mon chardev=mon,mode=control -qtest unix:path=/tmp/tmp.6XQrnYb2wb/qemu-15849-qtest.sock -accel qtest -nodefaults -display none -accel qtest -drive if=virtio,id=drive0,file=blkdebug::/tmp/qemu-test/test.img,format=qcow2,cache=writeback,aio=threads,backing.node-name=mid,backing.backing.node-name=base
+WARNING:qemu.machine:qemu received signal 6: /tmp/qemu-test/build/tests/qemu-iotests/../../x86_64-softmmu/qemu-system-x86_64 -display none -vga none -chardev socket,id=mon,path=/tmp/tmp.6XQrnYb2wb/qemu-15849-monitor.sock -mon chardev=mon,mode=control -qtest unix:path=/tmp/tmp.6XQrnYb2wb/qemu-15849-qtest.sock -accel qtest -nodefaults -display none -accel qtest -drive if=virtio,id=drive0,file=blkdebug::/tmp/qemu-test/test.img,format=qcow2,cache=writeback,aio=threads,backing.node-name=mid,backing.backing.node-name=base
+WARNING:qemu.machine:qemu received signal 6: /tmp/qemu-test/build/tests/qemu-iotests/../../x86_64-softmmu/qemu-system-x86_64 -display none -vga none -chardev socket,id=mon,path=/tmp/tmp.6XQrnYb2wb/qemu-15849-monitor.sock -mon chardev=mon,mode=control -qtest unix:path=/tmp/tmp.6XQrnYb2wb/qemu-15849-qtest.sock -accel qtest -nodefaults -display none -accel qtest -drive if=virtio,id=drive0,file=blkdebug::/tmp/qemu-test/test.img,format=qcow2,cache=writeback,aio=threads,backing.node-name=mid,backing.backing.node-name=base
+WARNING:qemu.machine:qemu received signal 6: /tmp/qemu-test/build/tests/qemu-iotests/../../x86_64-softmmu/qemu-system-x86_64 -display none -vga none -chardev socket,id=mon,path=/tmp/tmp.6XQrnYb2wb/qemu-15849-monitor.sock -mon chardev=mon,mode=control -qtest unix:path=/tmp/tmp.6XQrnYb2wb/qemu-15849-qtest.sock -accel qtest -nodefaults -display none -accel qtest -drive if=virtio,id=drive0,file=blkdebug::/tmp/qemu-test/test.img,format=qcow2,cache=writeback,aio=threads,backing.node-name=mid,backing.backing.node-name=base
+WARNING:qemu.machine:qemu received signal 6: /tmp/qemu-test/build/tests/qemu-iotests/../../x86_64-softmmu/qemu-system-x86_64 -display none -vga none -chardev socket,id=mon,path=/tmp/tmp.6XQrnYb2wb/qemu-15849-monitor.sock -mon chardev=mon,mode=control -qtest unix:path=/tmp/tmp.6XQrnYb2wb/qemu-15849-qtest.sock -accel qtest -nodefaults -display none -accel qtest -drive if=virtio,id=drive0,file=blkdebug::/tmp/qemu-test/test.img,format=qcow2,cache=writeback,aio=threads,backing.node-name=mid,backing.backing.node-name=base
+WARNING:qemu.machine:qemu received signal 6: /tmp/qemu-test/build/tests/qemu-iotests/../../x86_64-softmmu/qemu-system-x86_64 -display none -vga none -chardev socket,id=mon,path=/tmp/tmp.6XQrnYb2wb/qemu-15849-monitor.sock -mon chardev=mon,mode=control -qtest unix:path=/tmp/tmp.6XQrnYb2wb/qemu-15849-qtest.sock -accel qtest -nodefaults -display none -accel qtest -drive if=virtio,id=drive0,file=blkdebug::/tmp/qemu-test/test.img,format=qcow2,cache=writeback,aio=threads,backing.node-name=mid,backing.backing.node-name=base
+WARNING:qemu.machine:qemu received signal 6: /tmp/qemu-test/build/tests/qemu-iotests/../../x86_64-softmmu/qemu-system-x86_64 -display none -vga none -chardev socket,id=mon,path=/tmp/tmp.6XQrnYb2wb/qemu-15849-monitor.sock -mon chardev=mon,mode=control -qtest unix:path=/tmp/tmp.6XQrnYb2wb/qemu-15849-qtest.sock -accel qtest -nodefaults -display none -accel qtest -drive if=virtio,id=drive0,file=blkdebug::/tmp/qemu-test/test.img,format=qcow2,cache=writeback,aio=threads,backing.node-name=mid,backing.backing.node-name=base
+WARNING:qemu.machine:qemu received signal 6: /tmp/qemu-test/build/tests/qemu-iotests/../../x86_64-softmmu/qemu-system-x86_64 -display none -vga none -chardev socket,id=mon,path=/tmp/tmp.6XQrnYb2wb/qemu-15849-monitor.sock -mon chardev=mon,mode=control -qtest unix:path=/tmp/tmp.6XQrnYb2wb/qemu-15849-qtest.sock -accel qtest -nodefaults -display none -accel qtest -drive if=virtio,id=drive0,file=blkdebug::/tmp/qemu-test/test.img,format=qcow2,cache=writeback,aio=threads,backing.node-name=mid,backing.backing.node-name=base
+WARNING:qemu.machine:qemu received signal 6: /tmp/qemu-test/build/tests/qemu-iotests/../../x86_64-softmmu/qemu-system-x86_64 -display none -vga none -chardev socket,id=mon,path=/tmp/tmp.6XQrnYb2wb/qemu-15849-monitor.sock -mon chardev=mon,mode=control -qtest unix:path=/tmp/tmp.6XQrnYb2wb/qemu-15849-qtest.sock -accel qtest -nodefaults -display none -accel qtest -drive if=virtio,id=drive0,file=/tmp/qemu-test/test.img,format=qcow2,cache=writeback,aio=threads
+WARNING:qemu.machine:qemu received signal 6: /tmp/qemu-test/build/tests/qemu-iotests/../../x86_64-softmmu/qemu-system-x86_64 -display none -vga none -chardev socket,id=mon,path=/tmp/tmp.6XQrnYb2wb/qemu-15849-monitor.sock -mon chardev=mon,mode=control -qtest unix:path=/tmp/tmp.6XQrnYb2wb/qemu-15849-qtest.sock -accel qtest -nodefaults -display none -accel qtest -drive if=virtio,id=drive0,file=blkdebug::/tmp/qemu-test/test.img,format=qcow2,cache=writeback,aio=threads
+EEEEEEEEEEEEEE.EEEEEEEEEEEE
+======================================================================
+ERROR: test_enospc (__main__.TestEIO)
+----------------------------------------------------------------------
+Traceback (most recent call last):
+  File "030", line 644, in setUp
---
+socket.timeout: timed out
+
+======================================================================
+ERROR: test_ignore (__main__.TestEIO)
+----------------------------------------------------------------------
+Traceback (most recent call last):
+  File "030", line 644, in setUp
---
+socket.timeout: timed out
+
+======================================================================
+ERROR: test_report (__main__.TestEIO)
+----------------------------------------------------------------------
+Traceback (most recent call last):
+  File "030", line 644, in setUp
---
+socket.timeout: timed out
+
+======================================================================
+ERROR: test_stop (__main__.TestEIO)
+----------------------------------------------------------------------
+Traceback (most recent call last):
+  File "030", line 644, in setUp
---
+socket.timeout: timed out
+
+======================================================================
+ERROR: test_enospc (__main__.TestENOSPC)
+----------------------------------------------------------------------
+Traceback (most recent call last):
+  File "030", line 794, in setUp
---
+socket.timeout: timed out
+
+======================================================================
+ERROR: test_overlapping_1 (__main__.TestParallelOps)
+----------------------------------------------------------------------
+Traceback (most recent call last):
+  File "030", line 217, in setUp
---
+socket.timeout: timed out
+
+======================================================================
+ERROR: test_overlapping_2 (__main__.TestParallelOps)
+----------------------------------------------------------------------
+Traceback (most recent call last):
+  File "030", line 217, in setUp
---
+socket.timeout: timed out
+
+======================================================================
+ERROR: test_overlapping_3 (__main__.TestParallelOps)
+----------------------------------------------------------------------
+Traceback (most recent call last):
+  File "030", line 217, in setUp
---
+socket.timeout: timed out
+
+======================================================================
+ERROR: test_overlapping_4 (__main__.TestParallelOps)
+----------------------------------------------------------------------
+Traceback (most recent call last):
+  File "030", line 217, in setUp
---
+socket.timeout: timed out
+
+======================================================================
+ERROR: test_overlapping_5 (__main__.TestParallelOps)
+----------------------------------------------------------------------
+Traceback (most recent call last):
+  File "030", line 217, in setUp
---
+socket.timeout: timed out
+
+======================================================================
+ERROR: test_stream_base_node_name (__main__.TestParallelOps)
+----------------------------------------------------------------------
+Traceback (most recent call last):
+  File "030", line 217, in setUp
---
+socket.timeout: timed out
+
+======================================================================
+ERROR: test_stream_commit_1 (__main__.TestParallelOps)
+----------------------------------------------------------------------
+Traceback (most recent call last):
+  File "030", line 217, in setUp
---
+socket.timeout: timed out
+
+======================================================================
+ERROR: test_stream_commit_2 (__main__.TestParallelOps)
+----------------------------------------------------------------------
+Traceback (most recent call last):
+  File "030", line 217, in setUp
---
+socket.timeout: timed out
+
+======================================================================
+ERROR: test_stream_parallel (__main__.TestParallelOps)
+----------------------------------------------------------------------
+Traceback (most recent call last):
+  File "030", line 217, in setUp
---
+socket.timeout: timed out
+
+======================================================================
+ERROR: test_set_speed (__main__.TestSetSpeed)
+----------------------------------------------------------------------
+Traceback (most recent call last):
+  File "030", line 885, in setUp
---
+socket.timeout: timed out
+
+======================================================================
+ERROR: test_set_speed_invalid (__main__.TestSetSpeed)
+----------------------------------------------------------------------
+Traceback (most recent call last):
+  File "030", line 885, in setUp
---
+socket.timeout: timed out
+
+======================================================================
+ERROR: test_device_not_found (__main__.TestSingleDrive)
+----------------------------------------------------------------------
+Traceback (most recent call last):
+  File "030", line 42, in setUp
---
+socket.timeout: timed out
+
+======================================================================
+ERROR: test_job_id_missing (__main__.TestSingleDrive)
+----------------------------------------------------------------------
+Traceback (most recent call last):
+  File "030", line 42, in setUp
---
+socket.timeout: timed out
+
+======================================================================
+ERROR: test_read_only (__main__.TestSingleDrive)
+----------------------------------------------------------------------
+Traceback (most recent call last):
+  File "030", line 42, in setUp
---
+socket.timeout: timed out
+
+======================================================================
+ERROR: test_stream (__main__.TestSingleDrive)
+----------------------------------------------------------------------
+Traceback (most recent call last):
+  File "030", line 42, in setUp
---
+socket.timeout: timed out
+
+======================================================================
+ERROR: test_stream_intermediate (__main__.TestSingleDrive)
+----------------------------------------------------------------------
+Traceback (most recent call last):
+  File "030", line 42, in setUp
---
+socket.timeout: timed out
+
+======================================================================
+ERROR: test_stream_no_op (__main__.TestSingleDrive)
+----------------------------------------------------------------------
+Traceback (most recent call last):
+  File "030", line 42, in setUp
---
+socket.timeout: timed out
+
+======================================================================
+ERROR: test_stream_partial (__main__.TestSingleDrive)
+----------------------------------------------------------------------
+Traceback (most recent call last):
+  File "030", line 42, in setUp
---
+socket.timeout: timed out
+
+======================================================================
+ERROR: test_stream_pause (__main__.TestSingleDrive)
+----------------------------------------------------------------------
+Traceback (most recent call last):
+  File "030", line 42, in setUp
---
+socket.timeout: timed out
+
+======================================================================
+ERROR: test_stream (__main__.TestSmallerBackingFile)
+----------------------------------------------------------------------
+Traceback (most recent call last):
+  File "030", line 590, in setUp
---
+socket.timeout: timed out
+
+======================================================================
+ERROR: test_stream_stop (__main__.TestStreamStop)
+----------------------------------------------------------------------
+Traceback (most recent call last):
+  File "030", line 854, in setUp
---
 Ran 27 tests
 
-OK
+FAILED (errors=26, skipped=1)
  TEST    iotest-qcow2: 031
  TEST    iotest-qcow2: 032
  TEST    iotest-qcow2: 033
---
+++ /tmp/qemu-test/build/tests/qemu-iotests/040.out.bad 2020-06-30 13:17:24.520153424 +0000
@@ -1,5 +1,1244 @@
-...........................................................
+WARNING:qemu.machine:qemu received signal 6: /tmp/qemu-test/build/tests/qemu-iotests/../../x86_64-softmmu/qemu-system-x86_64 -display none -vga none -chardev socket,id=mon,path=/tmp/tmp.6XQrnYb2wb/qemu-18842-monitor.sock -mon chardev=mon,mode=control -qtest unix:path=/tmp/tmp.6XQrnYb2wb/qemu-18842-qtest.sock -accel qtest -nodefaults -display none -accel qtest -drive if=none,id=drive0,file=/tmp/qemu-test/test.img,format=qcow2,cache=writeback,aio=threads,node-name=top,backing.node-name=mid,backing.backing.node-name=base -device virtio-scsi-pci -device scsi-hd,id=scsi0,drive=drive0
+WARNING:qemu.machine:qemu received signal 6: /tmp/qemu-test/build/tests/qemu-iotests/../../x86_64-softmmu/qemu-system-x86_64 -display none -vga none -chardev socket,id=mon,path=/tmp/tmp.6XQrnYb2wb/qemu-18842-monitor.sock -mon chardev=mon,mode=control -qtest unix:path=/tmp/tmp.6XQrnYb2wb/qemu-18842-qtest.sock -accel qtest -nodefaults -display none -accel qtest -drive if=none,id=drive0,file=/tmp/qemu-test/test.img,format=qcow2,cache=writeback,aio=threads,node-name=top,backing.node-name=mid,backing.backing.node-name=base -device virtio-scsi-pci -device scsi-hd,id=scsi0,drive=drive0
+WARNING:qemu.machine:qemu received signal 6: /tmp/qemu-test/build/tests/qemu-iotests/../../x86_64-softmmu/qemu-system-x86_64 -display none -vga none -chardev socket,id=mon,path=/tmp/tmp.6XQrnYb2wb/qemu-18842-monitor.sock -mon chardev=mon,mode=control -qtest unix:path=/tmp/tmp.6XQrnYb2wb/qemu-18842-qtest.sock -accel qtest -nodefaults -display none -accel qtest -drive if=none,id=drive0,file=/tmp/qemu-test/test.img,format=qcow2,cache=writeback,aio=threads,node-name=top,backing.node-name=mid,backing.backing.node-name=base -device virtio-scsi-pci -device scsi-hd,id=scsi0,drive=drive0
+WARNING:qemu.machine:qemu received signal 6: /tmp/qemu-test/build/tests/qemu-iotests/../../x86_64-softmmu/qemu-system-x86_64 -display none -vga none -chardev socket,id=mon,path=/tmp/tmp.6XQrnYb2wb/qemu-18842-monitor.sock -mon chardev=mon,mode=control -qtest unix:path=/tmp/tmp.6XQrnYb2wb/qemu-18842-qtest.sock -accel qtest -nodefaults -display none -accel qtest -drive if=none,id=drive0,file=/tmp/qemu-test/test.img,format=qcow2,cache=writeback,aio=threads,node-name=top,backing.node-name=mid,backing.backing.node-name=base -device virtio-scsi-pci -device scsi-hd,id=scsi0,drive=drive0
+WARNING:qemu.machine:qemu received signal 6: /tmp/qemu-test/build/tests/qemu-iotests/../../x86_64-softmmu/qemu-system-x86_64 -display none -vga none -chardev socket,id=mon,path=/tmp/tmp.6XQrnYb2wb/qemu-18842-monitor.sock -mon chardev=mon,mode=control -qtest unix:path=/tmp/tmp.6XQrnYb2wb/qemu-18842-qtest.sock -accel qtest -nodefaults -display none -accel qtest -drive if=none,id=drive0,file=/tmp/qemu-test/test.img,format=qcow2,cache=writeback,aio=threads,node-name=top,backing.node-name=mid,backing.backing.node-name=base -device virtio-scsi-pci -device scsi-hd,id=scsi0,drive=drive0
+WARNING:qemu.machine:qemu received signal 6: /tmp/qemu-test/build/tests/qemu-iotests/../../x86_64-softmmu/qemu-system-x86_64 -display none -vga none -chardev socket,id=mon,path=/tmp/tmp.6XQrnYb2wb/qemu-18842-monitor.sock -mon chardev=mon,mode=control -qtest unix:path=/tmp/tmp.6XQrnYb2wb/qemu-18842-qtest.sock -accel qtest -nodefaults -display none -accel qtest -drive if=none,id=drive0,file=/tmp/qemu-test/test.img,format=qcow2,cache=writeback,aio=threads,node-name=top,backing.node-name=mid,backing.backing.node-name=base -device virtio-scsi-pci -device scsi-hd,id=scsi0,drive=drive0
+WARNING:qemu.machine:qemu received signal 6: /tmp/qemu-test/build/tests/qemu-iotests/../../x86_64-softmmu/qemu-system-x86_64 -display none -vga none -chardev socket,id=mon,path=/tmp/tmp.6XQrnYb2wb/qemu-18842-monitor.sock -mon chardev=mon,mode=control -qtest unix:path=/tmp/tmp.6XQrnYb2wb/qemu-18842-qtest.sock -accel qtest -nodefaults -display none -accel qtest -drive if=none,id=drive0,file=/tmp/qemu-test/test.img,format=qcow2,cache=writeback,aio=threads,node-name=top,backing.node-name=mid,backing.backing.node-name=base -device virtio-scsi-pci -device scsi-hd,id=scsi0,drive=drive0
+WARNING:qemu.machine:qemu received signal 6: /tmp/qemu-test/build/tests/qemu-iotests/../../x86_64-softmmu/qemu-system-x86_64 -display none -vga none -chardev socket,id=mon,path=/tmp/tmp.6XQrnYb2wb/qemu-18842-monitor.sock -mon chardev=mon,mode=control -qtest unix:path=/tmp/tmp.6XQrnYb2wb/qemu-18842-qtest.sock -accel qtest -nodefaults -display none -accel qtest -drive if=none,id=drive0,file=/tmp/qemu-test/test.img,format=qcow2,cache=writeback,aio=threads,node-name=top,backing.node-name=mid,backing.backing.node-name=base -device virtio-scsi-pci -device scsi-hd,id=scsi0,drive=drive0
+WARNING:qemu.machine:qemu received signal 6: /tmp/qemu-test/build/tests/qemu-iotests/../../x86_64-softmmu/qemu-system-x86_64 -display none -vga none -chardev socket,id=mon,path=/tmp/tmp.6XQrnYb2wb/qemu-18842-monitor.sock -mon chardev=mon,mode=control -qtest unix:path=/tmp/tmp.6XQrnYb2wb/qemu-18842-qtest.sock -accel qtest -nodefaults -display none -accel qtest -drive if=none,id=drive0,file=/tmp/qemu-test/test.img,format=qcow2,cache=writeback,aio=threads,node-name=top,backing.node-name=mid,backing.backing.node-name=base -device virtio-scsi-pci -device scsi-hd,id=scsi0,drive=drive0
+WARNING:qemu.machine:qemu received signal 6: /tmp/qemu-test/build/tests/qemu-iotests/../../x86_64-softmmu/qemu-system-x86_64 -display none -vga none -chardev socket,id=mon,path=/tmp/tmp.6XQrnYb2wb/qemu-18842-monitor.sock -mon chardev=mon,mode=control -qtest unix:path=/tmp/tmp.6XQrnYb2wb/qemu-18842-qtest.sock -accel qtest -nodefaults -display none -accel qtest -drive if=none,id=drive0,file=/tmp/qemu-test/test.img,format=qcow2,cache=writeback,aio=threads,node-name=top,backing.node-name=mid,backing.backing.node-name=base -device virtio-scsi-pci -device scsi-hd,id=scsi0,drive=drive0
+WARNING:qemu.machine:qemu received signal 6: /tmp/qemu-test/build/tests/qemu-iotests/../../x86_64-softmmu/qemu-system-x86_64 -display none -vga none -chardev socket,id=mon,path=/tmp/tmp.6XQrnYb2wb/qemu-18842-monitor.sock -mon chardev=mon,mode=control -qtest unix:path=/tmp/tmp.6XQrnYb2wb/qemu-18842-qtest.sock -accel qtest -nodefaults -display none -accel qtest -drive if=none,id=drive0,file=/tmp/qemu-test/test.img,format=qcow2,cache=writeback,aio=threads,node-name=top,backing.node-name=mid,backing.backing.node-name=base -device virtio-scsi-pci -device scsi-hd,id=scsi0,drive=drive0
+WARNING:qemu.machine:qemu received signal 6: /tmp/qemu-test/build/tests/qemu-iotests/../../x86_64-softmmu/qemu-system-x86_64 -display none -vga none -chardev socket,id=mon,path=/tmp/tmp.6XQrnYb2wb/qemu-18842-monitor.sock -mon chardev=mon,mode=control -qtest unix:path=/tmp/tmp.6XQrnYb2wb/qemu-18842-qtest.sock -accel qtest -nodefaults -display none -accel qtest -drive if=none,id=drive0,file=/tmp/qemu-test/test.img,format=qcow2,cache=writeback,aio=threads,node-name=top,backing.node-name=mid,backing.backing.node-name=base -device virtio-scsi-pci -device scsi-hd,id=scsi0,drive=drive0
+WARNING:qemu.machine:qemu received signal 6: /tmp/qemu-test/build/tests/qemu-iotests/../../x86_64-softmmu/qemu-system-x86_64 -display none -vga none -chardev socket,id=mon,path=/tmp/tmp.6XQrnYb2wb/qemu-18842-monitor.sock -mon chardev=mon,mode=control -qtest unix:path=/tmp/tmp.6XQrnYb2wb/qemu-18842-qtest.sock -accel qtest -nodefaults -display none -accel qtest -drive if=none,id=drive0,file=/tmp/qemu-test/test.img,format=qcow2,cache=writeback,aio=threads,node-name=top,backing.node-name=mid,backing.backing.node-name=base -device virtio-scsi-pci -device scsi-hd,id=scsi0,drive=drive0
+WARNING:qemu.machine:qemu received signal 6: /tmp/qemu-test/build/tests/qemu-iotests/../../x86_64-softmmu/qemu-system-x86_64 -display none -vga none -chardev socket,id=mon,path=/tmp/tmp.6XQrnYb2wb/qemu-18842-monitor.sock -mon chardev=mon,mode=control -qtest unix:path=/tmp/tmp.6XQrnYb2wb/qemu-18842-qtest.sock -accel qtest -nodefaults -display none -accel qtest -drive if=none,id=drive0,file=/tmp/qemu-test/test.img,format=qcow2,cache=writeback,aio=threads,node-name=top,backing.node-name=mid,backing.backing.node-name=base -device virtio-scsi-pci -device scsi-hd,id=scsi0,drive=drive0
+WARNING:qemu.machine:qemu received signal 6: /tmp/qemu-test/build/tests/qemu-iotests/../../x86_64-softmmu/qemu-system-x86_64 -display none -vga none -chardev socket,id=mon,path=/tmp/tmp.6XQrnYb2wb/qemu-18842-monitor.sock -mon chardev=mon,mode=control -qtest unix:path=/tmp/tmp.6XQrnYb2wb/qemu-18842-qtest.sock -accel qtest -nodefaults -display none -accel qtest -drive if=none,id=drive0,file=/tmp/qemu-test/test.img,format=qcow2,cache=writeback,aio=threads,node-name=top,backing.node-name=mid,backing.backing.node-name=base -device virtio-scsi-pci -device scsi-hd,id=scsi0,drive=drive0
+WARNING:qemu.machine:qemu received signal 6: /tmp/qemu-test/build/tests/qemu-iotests/../../x86_64-softmmu/qemu-system-x86_64 -display none -vga none -chardev socket,id=mon,path=/tmp/tmp.6XQrnYb2wb/qemu-18842-monitor.sock -mon chardev=mon,mode=control -qtest unix:path=/tmp/tmp.6XQrnYb2wb/qemu-18842-qtest.sock -accel qtest -nodefaults -display none -accel qtest -drive if=none,id=drive0,file=/tmp/qemu-test/test.img,format=qcow2,cache=writeback,aio=threads,node-name=top,backing.node-name=mid,backing.backing.node-name=base -device virtio-scsi-pci -device scsi-hd,id=scsi0,drive=drive0
+WARNING:qemu.machine:qemu received signal 6: /tmp/qemu-test/build/tests/qemu-iotests/../../x86_64-softmmu/qemu-system-x86_64 -display none -vga none -chardev socket,id=mon,path=/tmp/tmp.6XQrnYb2wb/qemu-18842-monitor.sock -mon chardev=mon,mode=control -qtest unix:path=/tmp/tmp.6XQrnYb2wb/qemu-18842-qtest.sock -accel qtest -nodefaults -display none -accel qtest -drive if=none,id=drive0,file=/tmp/qemu-test/test.img,format=qcow2,cache=writeback,aio=threads,node-name=top,backing.node-name=mid,backing.backing.node-name=base -device virtio-scsi-pci -device scsi-hd,id=scsi0,drive=drive0
+WARNING:qemu.machine:qemu received signal 6: /tmp/qemu-test/build/tests/qemu-iotests/../../x86_64-softmmu/qemu-system-x86_64 -display none -vga none -chardev socket,id=mon,path=/tmp/tmp.6XQrnYb2wb/qemu-18842-monitor.sock -mon chardev=mon,mode=control -qtest unix:path=/tmp/tmp.6XQrnYb2wb/qemu-18842-qtest.sock -accel qtest -nodefaults -display none -accel qtest -drive if=none,id=drive0,file=/tmp/qemu-test/test.img,format=qcow2,cache=writeback,aio=threads,node-name=top,backing.node-name=mid,backing.backing.node-name=base -device virtio-scsi-pci -device scsi-hd,id=scsi0,drive=drive0
+WARNING:qemu.machine:qemu received signal 6: /tmp/qemu-test/build/tests/qemu-iotests/../../x86_64-softmmu/qemu-system-x86_64 -display none -vga none -chardev socket,id=mon,path=/tmp/tmp.6XQrnYb2wb/qemu-18842-monitor.sock -mon chardev=mon,mode=control -qtest unix:path=/tmp/tmp.6XQrnYb2wb/qemu-18842-qtest.sock -accel qtest -nodefaults -display none -accel qtest -drive if=none,id=drive0,file=/tmp/qemu-test/test.img,format=qcow2,cache=writeback,aio=threads,node-name=top,backing.node-name=mid,backing.backing.node-name=base -device virtio-scsi-pci -device scsi-hd,id=scsi0,drive=drive0
+WARNING:qemu.machine:qemu received signal 6: /tmp/qemu-test/build/tests/qemu-iotests/../../x86_64-softmmu/qemu-system-x86_64 -display none -vga none -chardev socket,id=mon,path=/tmp/tmp.6XQrnYb2wb/qemu-18842-monitor.sock -mon chardev=mon,mode=control -qtest unix:path=/tmp/tmp.6XQrnYb2wb/qemu-18842-qtest.sock -accel qtest -nodefaults -display none -accel qtest
+WARNING:qemu.machine:qemu received signal 6: /tmp/qemu-test/build/tests/qemu-iotests/../../x86_64-softmmu/qemu-system-x86_64 -display none -vga none -chardev socket,id=mon,path=/tmp/tmp.6XQrnYb2wb/qemu-18842-monitor.sock -mon chardev=mon,mode=control -qtest unix:path=/tmp/tmp.6XQrnYb2wb/qemu-18842-qtest.sock -accel qtest -nodefaults -display none -accel qtest
+WARNING:qemu.machine:qemu received signal 6: /tmp/qemu-test/build/tests/qemu-iotests/../../x86_64-softmmu/qemu-system-x86_64 -display none -vga none -chardev socket,id=mon,path=/tmp/tmp.6XQrnYb2wb/qemu-18842-monitor.sock -mon chardev=mon,mode=control -qtest unix:path=/tmp/tmp.6XQrnYb2wb/qemu-18842-qtest.sock -accel qtest -nodefaults -display none -accel qtest
+WARNING:qemu.machine:qemu received signal 6: /tmp/qemu-test/build/tests/qemu-iotests/../../x86_64-softmmu/qemu-system-x86_64 -display none -vga none -chardev socket,id=mon,path=/tmp/tmp.6XQrnYb2wb/qemu-18842-monitor.sock -mon chardev=mon,mode=control -qtest unix:path=/tmp/tmp.6XQrnYb2wb/qemu-18842-qtest.sock -accel qtest -nodefaults -display none -accel qtest
+WARNING:qemu.machine:qemu received signal 6: /tmp/qemu-test/build/tests/qemu-iotests/../../x86_64-softmmu/qemu-system-x86_64 -display none -vga none -chardev socket,id=mon,path=/tmp/tmp.6XQrnYb2wb/qemu-18842-monitor.sock -mon chardev=mon,mode=control -qtest unix:path=/tmp/tmp.6XQrnYb2wb/qemu-18842-qtest.sock -accel qtest -nodefaults -display none -accel qtest
+WARNING:qemu.machine:qemu received signal 6: /tmp/qemu-test/build/tests/qemu-iotests/../../x86_64-softmmu/qemu-system-x86_64 -display none -vga none -chardev socket,id=mon,path=/tmp/tmp.6XQrnYb2wb/qemu-18842-monitor.sock -mon chardev=mon,mode=control -qtest unix:path=/tmp/tmp.6XQrnYb2wb/qemu-18842-qtest.sock -accel qtest -nodefaults -display none -accel qtest
+WARNING:qemu.machine:qemu received signal 6: /tmp/qemu-test/build/tests/qemu-iotests/../../x86_64-softmmu/qemu-system-x86_64 -display none -vga none -chardev socket,id=mon,path=/tmp/tmp.6XQrnYb2wb/qemu-18842-monitor.sock -mon chardev=mon,mode=control -qtest unix:path=/tmp/tmp.6XQrnYb2wb/qemu-18842-qtest.sock -accel qtest -nodefaults -display none -accel qtest
+WARNING:qemu.machine:qemu received signal 6: /tmp/qemu-test/build/tests/qemu-iotests/../../x86_64-softmmu/qemu-system-x86_64 -display none -vga none -chardev socket,id=mon,path=/tmp/tmp.6XQrnYb2wb/qemu-18842-monitor.sock -mon chardev=mon,mode=control -qtest unix:path=/tmp/tmp.6XQrnYb2wb/qemu-18842-qtest.sock -accel qtest -nodefaults -display none -accel qtest
+WARNING:qemu.machine:qemu received signal 6: /tmp/qemu-test/build/tests/qemu-iotests/../../x86_64-softmmu/qemu-system-x86_64 -display none -vga none -chardev socket,id=mon,path=/tmp/tmp.6XQrnYb2wb/qemu-18842-monitor.sock -mon chardev=mon,mode=control -qtest unix:path=/tmp/tmp.6XQrnYb2wb/qemu-18842-qtest.sock -accel qtest -nodefaults -display none -accel qtest
+WARNING:qemu.machine:qemu received signal 6: /tmp/qemu-test/build/tests/qemu-iotests/../../x86_64-softmmu/qemu-system-x86_64 -display none -vga none -chardev socket,id=mon,path=/tmp/tmp.6XQrnYb2wb/qemu-18842-monitor.sock -mon chardev=mon,mode=control -qtest unix:path=/tmp/tmp.6XQrnYb2wb/qemu-18842-qtest.sock -accel qtest -nodefaults -display none -accel qtest
+WARNING:qemu.machine:qemu received signal 6: /tmp/qemu-test/build/tests/qemu-iotests/../../x86_64-softmmu/qemu-system-x86_64 -display none -vga none -chardev socket,id=mon,path=/tmp/tmp.6XQrnYb2wb/qemu-18842-monitor.sock -mon chardev=mon,mode=control -qtest unix:path=/tmp/tmp.6XQrnYb2wb/qemu-18842-qtest.sock -accel qtest -nodefaults -display none -accel qtest
+WARNING:qemu.machine:qemu received signal 6: /tmp/qemu-test/build/tests/qemu-iotests/../../x86_64-softmmu/qemu-system-x86_64 -display none -vga none -chardev socket,id=mon,path=/tmp/tmp.6XQrnYb2wb/qemu-18842-monitor.sock -mon chardev=mon,mode=control -qtest unix:path=/tmp/tmp.6XQrnYb2wb/qemu-18842-qtest.sock -accel qtest -nodefaults -display none -accel qtest
+WARNING:qemu.machine:qemu received signal 6: /tmp/qemu-test/build/tests/qemu-iotests/../../x86_64-softmmu/qemu-system-x86_64 -display none -vga none -chardev socket,id=mon,path=/tmp/tmp.6XQrnYb2wb/qemu-18842-monitor.sock -mon chardev=mon,mode=control -qtest unix:path=/tmp/tmp.6XQrnYb2wb/qemu-18842-qtest.sock -accel qtest -nodefaults -display none -accel qtest -drive if=virtio,id=drive0,file=/tmp/qemu-test/dir2/dir3/test.img,format=qcow2,cache=writeback,aio=threads
+WARNING:qemu.machine:qemu received signal 6: /tmp/qemu-test/build/tests/qemu-iotests/../../x86_64-softmmu/qemu-system-x86_64 -display none -vga none -chardev socket,id=mon,path=/tmp/tmp.6XQrnYb2wb/qemu-18842-monitor.sock -mon chardev=mon,mode=control -qtest unix:path=/tmp/tmp.6XQrnYb2wb/qemu-18842-qtest.sock -accel qtest -nodefaults -display none -accel qtest -drive if=virtio,id=drive0,file=/tmp/qemu-test/dir2/dir3/test.img,format=qcow2,cache=writeback,aio=threads
+WARNING:qemu.machine:qemu received signal 6: /tmp/qemu-test/build/tests/qemu-iotests/../../x86_64-softmmu/qemu-system-x86_64 -display none -vga none -chardev socket,id=mon,path=/tmp/tmp.6XQrnYb2wb/qemu-18842-monitor.sock -mon chardev=mon,mode=control -qtest unix:path=/tmp/tmp.6XQrnYb2wb/qemu-18842-qtest.sock -accel qtest -nodefaults -display none -accel qtest -drive if=virtio,id=drive0,file=/tmp/qemu-test/dir2/dir3/test.img,format=qcow2,cache=writeback,aio=threads
+WARNING:qemu.machine:qemu received signal 6: /tmp/qemu-test/build/tests/qemu-iotests/../../x86_64-softmmu/qemu-system-x86_64 -display none -vga none -chardev socket,id=mon,path=/tmp/tmp.6XQrnYb2wb/qemu-18842-monitor.sock -mon chardev=mon,mode=control -qtest unix:path=/tmp/tmp.6XQrnYb2wb/qemu-18842-qtest.sock -accel qtest -nodefaults -display none -accel qtest -drive if=virtio,id=drive0,file=/tmp/qemu-test/dir2/dir3/test.img,format=qcow2,cache=writeback,aio=threads
+WARNING:qemu.machine:qemu received signal 6: /tmp/qemu-test/build/tests/qemu-iotests/../../x86_64-softmmu/qemu-system-x86_64 -display none -vga none -chardev socket,id=mon,path=/tmp/tmp.6XQrnYb2wb/qemu-18842-monitor.sock -mon chardev=mon,mode=control -qtest unix:path=/tmp/tmp.6XQrnYb2wb/qemu-18842-qtest.sock -accel qtest -nodefaults -display none -accel qtest -drive if=virtio,id=drive0,file=/tmp/qemu-test/dir2/dir3/test.img,format=qcow2,cache=writeback,aio=threads
+WARNING:qemu.machine:qemu received signal 6: /tmp/qemu-test/build/tests/qemu-iotests/../../x86_64-softmmu/qemu-system-x86_64 -display none -vga none -chardev socket,id=mon,path=/tmp/tmp.6XQrnYb2wb/qemu-18842-monitor.sock -mon chardev=mon,mode=control -qtest unix:path=/tmp/tmp.6XQrnYb2wb/qemu-18842-qtest.sock -accel qtest -nodefaults -display none -accel qtest -drive if=virtio,id=drive0,file=/tmp/qemu-test/dir2/dir3/test.img,format=qcow2,cache=writeback,aio=threads
+WARNING:qemu.machine:qemu received signal 6: /tmp/qemu-test/build/tests/qemu-iotests/../../x86_64-softmmu/qemu-system-x86_64 -display none -vga none -chardev socket,id=mon,path=/tmp/tmp.6XQrnYb2wb/qemu-18842-monitor.sock -mon chardev=mon,mode=control -qtest unix:path=/tmp/tmp.6XQrnYb2wb/qemu-18842-qtest.sock -accel qtest -nodefaults -display none -accel qtest -drive if=virtio,id=drive0,file=/tmp/qemu-test/dir2/dir3/test.img,format=qcow2,cache=writeback,aio=threads
+WARNING:qemu.machine:qemu received signal 6: /tmp/qemu-test/build/tests/qemu-iotests/../../x86_64-softmmu/qemu-system-x86_64 -display none -vga none -chardev socket,id=mon,path=/tmp/tmp.6XQrnYb2wb/qemu-18842-monitor.sock -mon chardev=mon,mode=control -qtest unix:path=/tmp/tmp.6XQrnYb2wb/qemu-18842-qtest.sock -accel qtest -nodefaults -display none -accel qtest -drive if=virtio,id=drive0,file=/tmp/qemu-test/3.img,format=qcow2,cache=writeback,aio=threads
+WARNING:qemu.machine:qemu received signal 6: /tmp/qemu-test/build/tests/qemu-iotests/../../x86_64-softmmu/qemu-system-x86_64 -display none -vga none -chardev socket,id=mon,path=/tmp/tmp.6XQrnYb2wb/qemu-18842-monitor.sock -mon chardev=mon,mode=control -qtest unix:path=/tmp/tmp.6XQrnYb2wb/qemu-18842-qtest.sock -accel qtest -nodefaults -display none -accel qtest -drive if=virtio,id=drive0,file=blkdebug::/tmp/qemu-test/test.img,format=qcow2,cache=writeback,aio=threads
+WARNING:qemu.machine:qemu received signal 6: /tmp/qemu-test/build/tests/qemu-iotests/../../x86_64-softmmu/qemu-system-x86_64 -display none -vga none -chardev socket,id=mon,path=/tmp/tmp.6XQrnYb2wb/qemu-18842-monitor.sock -mon chardev=mon,mode=control -qtest unix:path=/tmp/tmp.6XQrnYb2wb/qemu-18842-qtest.sock -accel qtest -nodefaults -display none -accel qtest -drive if=none,id=drive0,file=/tmp/qemu-test/test.img,format=qcow2,cache=writeback,aio=threads,node-name=top,backing.node-name=mid,backing.backing.node-name=base -device virtio-scsi-pci -device scsi-hd,id=scsi0,drive=drive0
+WARNING:qemu.machine:qemu received signal 6: /tmp/qemu-test/build/tests/qemu-iotests/../../x86_64-softmmu/qemu-system-x86_64 -display none -vga none -chardev socket,id=mon,path=/tmp/tmp.6XQrnYb2wb/qemu-18842-monitor.sock -mon chardev=mon,mode=control -qtest unix:path=/tmp/tmp.6XQrnYb2wb/qemu-18842-qtest.sock -accel qtest -nodefaults -display none -accel qtest -drive if=none,id=drive0,file=/tmp/qemu-test/test.img,format=qcow2,cache=writeback,aio=threads,node-name=top,backing.node-name=mid,backing.backing.node-name=base -device virtio-scsi-pci -device scsi-hd,id=scsi0,drive=drive0
+WARNING:qemu.machine:qemu received signal 6: /tmp/qemu-test/build/tests/qemu-iotests/../../x86_64-softmmu/qemu-system-x86_64 -display none -vga none -chardev socket,id=mon,path=/tmp/tmp.6XQrnYb2wb/qemu-18842-monitor.sock -mon chardev=mon,mode=control -qtest unix:path=/tmp/tmp.6XQrnYb2wb/qemu-18842-qtest.sock -accel qtest -nodefaults -display none -accel qtest -drive if=none,id=drive0,file=/tmp/qemu-test/test.img,format=qcow2,cache=writeback,aio=threads,node-name=top,backing.node-name=mid,backing.backing.node-name=base -device virtio-scsi-pci -device scsi-hd,id=scsi0,drive=drive0
+WARNING:qemu.machine:qemu received signal 6: /tmp/qemu-test/build/tests/qemu-iotests/../../x86_64-softmmu/qemu-system-x86_64 -display none -vga none -chardev socket,id=mon,path=/tmp/tmp.6XQrnYb2wb/qemu-18842-monitor.sock -mon chardev=mon,mode=control -qtest unix:path=/tmp/tmp.6XQrnYb2wb/qemu-18842-qtest.sock -accel qtest -nodefaults -display none -accel qtest -drive if=none,id=drive0,file=/tmp/qemu-test/test.img,format=qcow2,cache=writeback,aio=threads,node-name=top,backing.node-name=mid,backing.backing.node-name=base -device virtio-scsi-pci -device scsi-hd,id=scsi0,drive=drive0
+WARNING:qemu.machine:qemu received signal 6: /tmp/qemu-test/build/tests/qemu-iotests/../../x86_64-softmmu/qemu-system-x86_64 -display none -vga none -chardev socket,id=mon,path=/tmp/tmp.6XQrnYb2wb/qemu-18842-monitor.sock -mon chardev=mon,mode=control -qtest unix:path=/tmp/tmp.6XQrnYb2wb/qemu-18842-qtest.sock -accel qtest -nodefaults -display none -accel qtest -drive if=none,id=drive0,file=/tmp/qemu-test/test.img,format=qcow2,cache=writeback,aio=threads,node-name=top,backing.node-name=mid,backing.backing.node-name=base -device virtio-scsi-pci -device scsi-hd,id=scsi0,drive=drive0
+WARNING:qemu.machine:qemu received signal 6: /tmp/qemu-test/build/tests/qemu-iotests/../../x86_64-softmmu/qemu-system-x86_64 -display none -vga none -chardev socket,id=mon,path=/tmp/tmp.6XQrnYb2wb/qemu-18842-monitor.sock -mon chardev=mon,mode=control -qtest unix:path=/tmp/tmp.6XQrnYb2wb/qemu-18842-qtest.sock -accel qtest -nodefaults -display none -accel qtest -drive if=none,id=drive0,file=/tmp/qemu-test/test.img,format=qcow2,cache=writeback,aio=threads,node-name=top,backing.node-name=mid,backing.backing.node-name=base -device virtio-scsi-pci -device scsi-hd,id=scsi0,drive=drive0
+WARNING:qemu.machine:qemu received signal 6: /tmp/qemu-test/build/tests/qemu-iotests/../../x86_64-softmmu/qemu-system-x86_64 -display none -vga none -chardev socket,id=mon,path=/tmp/tmp.6XQrnYb2wb/qemu-18842-monitor.sock -mon chardev=mon,mode=control -qtest unix:path=/tmp/tmp.6XQrnYb2wb/qemu-18842-qtest.sock -accel qtest -nodefaults -display none -accel qtest -drive if=none,id=drive0,file=/tmp/qemu-test/test.img,format=qcow2,cache=writeback,aio=threads,node-name=top,backing.node-name=mid,backing.backing.node-name=base -device virtio-scsi-pci -device scsi-hd,id=scsi0,drive=drive0
+WARNING:qemu.machine:qemu received signal 6: /tmp/qemu-test/build/tests/qemu-iotests/../../x86_64-softmmu/qemu-system-x86_64 -display none -vga none -chardev socket,id=mon,path=/tmp/tmp.6XQrnYb2wb/qemu-18842-monitor.sock -mon chardev=mon,mode=control -qtest unix:path=/tmp/tmp.6XQrnYb2wb/qemu-18842-qtest.sock -accel qtest -nodefaults -display none -accel qtest -drive if=none,id=drive0,file=/tmp/qemu-test/test.img,format=qcow2,cache=writeback,aio=threads,node-name=top,backing.node-name=mid,backing.backing.node-name=base -device virtio-scsi-pci -device scsi-hd,id=scsi0,drive=drive0
+WARNING:qemu.machine:qemu received signal 6: /tmp/qemu-test/build/tests/qemu-iotests/../../x86_64-softmmu/qemu-system-x86_64 -display none -vga none -chardev socket,id=mon,path=/tmp/tmp.6XQrnYb2wb/qemu-18842-monitor.sock -mon chardev=mon,mode=control -qtest unix:path=/tmp/tmp.6XQrnYb2wb/qemu-18842-qtest.sock -accel qtest -nodefaults -display none -accel qtest -drive if=none,id=drive0,file=/tmp/qemu-test/test.img,format=qcow2,cache=writeback,aio=threads,node-name=top,backing.node-name=mid,backing.backing.node-name=base -device virtio-scsi-pci -device scsi-hd,id=scsi0,drive=drive0
+WARNING:qemu.machine:qemu received signal 6: /tmp/qemu-test/build/tests/qemu-iotests/../../x86_64-softmmu/qemu-system-x86_64 -display none -vga none -chardev socket,id=mon,path=/tmp/tmp.6XQrnYb2wb/qemu-18842-monitor.sock -mon chardev=mon,mode=control -qtest unix:path=/tmp/tmp.6XQrnYb2wb/qemu-18842-qtest.sock -accel qtest -nodefaults -display none -accel qtest -drive if=none,id=drive0,file=/tmp/qemu-test/test.img,format=qcow2,cache=writeback,aio=threads,node-name=top,backing.node-name=mid,backing.backing.node-name=base -device virtio-scsi-pci -device scsi-hd,id=scsi0,drive=drive0
+WARNING:qemu.machine:qemu received signal 6: /tmp/qemu-test/build/tests/qemu-iotests/../../x86_64-softmmu/qemu-system-x86_64 -display none -vga none -chardev socket,id=mon,path=/tmp/tmp.6XQrnYb2wb/qemu-18842-monitor.sock -mon chardev=mon,mode=control -qtest unix:path=/tmp/tmp.6XQrnYb2wb/qemu-18842-qtest.sock -accel qtest -nodefaults -display none -accel qtest -drive if=none,id=drive0,file=/tmp/qemu-test/test.img,format=qcow2,cache=writeback,aio=threads,node-name=top,backing.node-name=mid,backing.backing.node-name=base -device virtio-scsi-pci -device scsi-hd,id=scsi0,drive=drive0
+WARNING:qemu.machine:qemu received signal 6: /tmp/qemu-test/build/tests/qemu-iotests/../../x86_64-softmmu/qemu-system-x86_64 -display none -vga none -chardev socket,id=mon,path=/tmp/tmp.6XQrnYb2wb/qemu-18842-monitor.sock -mon chardev=mon,mode=control -qtest unix:path=/tmp/tmp.6XQrnYb2wb/qemu-18842-qtest.sock -accel qtest -nodefaults -display none -accel qtest -drive if=none,id=drive0,file=/tmp/qemu-test/test.img,format=qcow2,cache=writeback,aio=threads,node-name=top,backing.node-name=mid,backing.backing.node-name=base -device virtio-scsi-pci -device scsi-hd,id=scsi0,drive=drive0
+WARNING:qemu.machine:qemu received signal 6: /tmp/qemu-test/build/tests/qemu-iotests/../../x86_64-softmmu/qemu-system-x86_64 -display none -vga none -chardev socket,id=mon,path=/tmp/tmp.6XQrnYb2wb/qemu-18842-monitor.sock -mon chardev=mon,mode=control -qtest unix:path=/tmp/tmp.6XQrnYb2wb/qemu-18842-qtest.sock -accel qtest -nodefaults -display none -accel qtest -drive if=none,id=drive0,file=/tmp/qemu-test/test.img,format=qcow2,cache=writeback,aio=threads,node-name=top,backing.node-name=mid,backing.backing.node-name=base -device virtio-scsi-pci -device scsi-hd,id=scsi0,drive=drive0
+WARNING:qemu.machine:qemu received signal 6: /tmp/qemu-test/build/tests/qemu-iotests/../../x86_64-softmmu/qemu-system-x86_64 -display none -vga none -chardev socket,id=mon,path=/tmp/tmp.6XQrnYb2wb/qemu-18842-monitor.sock -mon chardev=mon,mode=control -qtest unix:path=/tmp/tmp.6XQrnYb2wb/qemu-18842-qtest.sock -accel qtest -nodefaults -display none -accel qtest -drive if=none,id=drive0,file=/tmp/qemu-test/test.img,format=qcow2,cache=writeback,aio=threads,node-name=top,backing.node-name=mid,backing.backing.node-name=base -device virtio-scsi-pci -device scsi-hd,id=scsi0,drive=drive0
+WARNING:qemu.machine:qemu received signal 6: /tmp/qemu-test/build/tests/qemu-iotests/../../x86_64-softmmu/qemu-system-x86_64 -display none -vga none -chardev socket,id=mon,path=/tmp/tmp.6XQrnYb2wb/qemu-18842-monitor.sock -mon chardev=mon,mode=control -qtest unix:path=/tmp/tmp.6XQrnYb2wb/qemu-18842-qtest.sock -accel qtest -nodefaults -display none -accel qtest -drive if=none,id=drive0,file=/tmp/qemu-test/test.img,format=qcow2,cache=writeback,aio=threads,node-name=top,backing.node-name=mid,backing.backing.node-name=base -device virtio-scsi-pci -device scsi-hd,id=scsi0,drive=drive0
+WARNING:qemu.machine:qemu received signal 6: /tmp/qemu-test/build/tests/qemu-iotests/../../x86_64-softmmu/qemu-system-x86_64 -display none -vga none -chardev socket,id=mon,path=/tmp/tmp.6XQrnYb2wb/qemu-18842-monitor.sock -mon chardev=mon,mode=control -qtest unix:path=/tmp/tmp.6XQrnYb2wb/qemu-18842-qtest.sock -accel qtest -nodefaults -display none -accel qtest -drive if=none,id=drive0,file=/tmp/qemu-test/test.img,format=qcow2,cache=writeback,aio=threads,node-name=top,backing.node-name=mid,backing.backing.node-name=base -device virtio-scsi-pci -device scsi-hd,id=scsi0,drive=drive0
+WARNING:qemu.machine:qemu received signal 6: /tmp/qemu-test/build/tests/qemu-iotests/../../x86_64-softmmu/qemu-system-x86_64 -display none -vga none -chardev socket,id=mon,path=/tmp/tmp.6XQrnYb2wb/qemu-18842-monitor.sock -mon chardev=mon,mode=control -qtest unix:path=/tmp/tmp.6XQrnYb2wb/qemu-18842-qtest.sock -accel qtest -nodefaults -display none -accel qtest -drive if=none,id=drive0,file=/tmp/qemu-test/test.img,format=qcow2,cache=writeback,aio=threads,node-name=top,backing.node-name=mid,backing.backing.node-name=base -device virtio-scsi-pci -device scsi-hd,id=scsi0,drive=drive0
+WARNING:qemu.machine:qemu received signal 6: /tmp/qemu-test/build/tests/qemu-iotests/../../x86_64-softmmu/qemu-system-x86_64 -display none -vga none -chardev socket,id=mon,path=/tmp/tmp.6XQrnYb2wb/qemu-18842-monitor.sock -mon chardev=mon,mode=control -qtest unix:path=/tmp/tmp.6XQrnYb2wb/qemu-18842-qtest.sock -accel qtest -nodefaults -display none -accel qtest -drive if=none,id=drive0,file=/tmp/qemu-test/test.img,format=qcow2,cache=writeback,aio=threads,node-name=top,backing.node-name=mid,backing.backing.node-name=base -device virtio-scsi-pci -device scsi-hd,id=scsi0,drive=drive0
+WARNING:qemu.machine:qemu received signal 6: /tmp/qemu-test/build/tests/qemu-iotests/../../x86_64-softmmu/qemu-system-x86_64 -display none -vga none -chardev socket,id=mon,path=/tmp/tmp.6XQrnYb2wb/qemu-18842-monitor.sock -mon chardev=mon,mode=control -qtest unix:path=/tmp/tmp.6XQrnYb2wb/qemu-18842-qtest.sock -accel qtest -nodefaults -display none -accel qtest -drive if=none,id=drive0,file=/tmp/qemu-test/test.img,format=qcow2,cache=writeback,aio=threads,node-name=top,backing.node-name=mid,backing.backing.node-name=base -device virtio-scsi-pci -device scsi-hd,id=scsi0,drive=drive0
+EEEEEEEEEEEEEEEEEEEEEEEEEEEEEEEEEEEEEEEEEEEEEEEEEEEEEEEEEEE
+======================================================================
+ERROR: test_base_invalid (__main__.TestActiveZeroLengthImage)
+----------------------------------------------------------------------
+Traceback (most recent call last):
+  File "040", line 90, in setUp
---
+socket.timeout: timed out
+
+======================================================================
+ERROR: test_base_node_invalid (__main__.TestActiveZeroLengthImage)
+----------------------------------------------------------------------
+Traceback (most recent call last):
+  File "040", line 90, in setUp
---
+socket.timeout: timed out
+
+======================================================================
+ERROR: test_base_path_and_node (__main__.TestActiveZeroLengthImage)
+----------------------------------------------------------------------
+Traceback (most recent call last):
+  File "040", line 90, in setUp
---
+socket.timeout: timed out
+
+======================================================================
+ERROR: test_commit (__main__.TestActiveZeroLengthImage)
+----------------------------------------------------------------------
+Traceback (most recent call last):
+  File "040", line 90, in setUp
---
+socket.timeout: timed out
+
+======================================================================
+ERROR: test_commit_node (__main__.TestActiveZeroLengthImage)
+----------------------------------------------------------------------
+Traceback (most recent call last):
+  File "040", line 90, in setUp
---
+socket.timeout: timed out
+
+======================================================================
+ERROR: test_commit_plus_filter_and_quit (__main__.TestActiveZeroLengthImage)
+----------------------------------------------------------------------
+Traceback (most recent call last):
+  File "040", line 90, in setUp
---
+socket.timeout: timed out
+
+======================================================================
+ERROR: test_commit_with_filter_and_quit (__main__.TestActiveZeroLengthImage)
+----------------------------------------------------------------------
+Traceback (most recent call last):
+  File "040", line 90, in setUp
---
+socket.timeout: timed out
+
+======================================================================
+ERROR: test_device_not_found (__main__.TestActiveZeroLengthImage)
+----------------------------------------------------------------------
+Traceback (most recent call last):
+  File "040", line 90, in setUp
---
+socket.timeout: timed out
+
+======================================================================
+ERROR: test_hot_unplug (__main__.TestActiveZeroLengthImage)
+----------------------------------------------------------------------
+Traceback (most recent call last):
+  File "040", line 90, in setUp
---
+socket.timeout: timed out
+
+======================================================================
+ERROR: test_implicit_node (__main__.TestActiveZeroLengthImage)
+----------------------------------------------------------------------
+Traceback (most recent call last):
+  File "040", line 90, in setUp
---
+socket.timeout: timed out
+
+======================================================================
+ERROR: test_top_and_base_node_reversed (__main__.TestActiveZeroLengthImage)
+----------------------------------------------------------------------
+Traceback (most recent call last):
+  File "040", line 90, in setUp
---
+socket.timeout: timed out
+
+======================================================================
+ERROR: test_top_and_base_reversed (__main__.TestActiveZeroLengthImage)
+----------------------------------------------------------------------
+Traceback (most recent call last):
+  File "040", line 90, in setUp
---
+socket.timeout: timed out
+
+======================================================================
+ERROR: test_top_invalid (__main__.TestActiveZeroLengthImage)
+----------------------------------------------------------------------
+Traceback (most recent call last):
+  File "040", line 90, in setUp
---
+socket.timeout: timed out
+
+======================================================================
+ERROR: test_top_is_active (__main__.TestActiveZeroLengthImage)
+----------------------------------------------------------------------
+Traceback (most recent call last):
+  File "040", line 90, in setUp
---
+socket.timeout: timed out
+
+======================================================================
+ERROR: test_top_is_default_active (__main__.TestActiveZeroLengthImage)
+----------------------------------------------------------------------
+Traceback (most recent call last):
+  File "040", line 90, in setUp
---
+socket.timeout: timed out
+
+======================================================================
+ERROR: test_top_node_in_wrong_chain (__main__.TestActiveZeroLengthImage)
+----------------------------------------------------------------------
+Traceback (most recent call last):
+  File "040", line 90, in setUp
---
+socket.timeout: timed out
+
+======================================================================
+ERROR: test_top_node_invalid (__main__.TestActiveZeroLengthImage)
+----------------------------------------------------------------------
+Traceback (most recent call last):
+  File "040", line 90, in setUp
---
+socket.timeout: timed out
+
+======================================================================
+ERROR: test_top_path_and_node (__main__.TestActiveZeroLengthImage)
+----------------------------------------------------------------------
+Traceback (most recent call last):
+  File "040", line 90, in setUp
---
+socket.timeout: timed out
+
+======================================================================
+ERROR: test_top_same_base (__main__.TestActiveZeroLengthImage)
+----------------------------------------------------------------------
+Traceback (most recent call last):
+  File "040", line 90, in setUp
---
+socket.timeout: timed out
+
+======================================================================
+ERROR: testActiveReadErrorIgnore (__main__.TestErrorHandling)
+----------------------------------------------------------------------
+Traceback (most recent call last):
+  File "040", line 445, in setUp
---
+socket.timeout: timed out
+
+======================================================================
+ERROR: testActiveReadErrorReport (__main__.TestErrorHandling)
+----------------------------------------------------------------------
+Traceback (most recent call last):
+  File "040", line 445, in setUp
---
+socket.timeout: timed out
+
+======================================================================
+ERROR: testActiveReadErrorStop (__main__.TestErrorHandling)
+----------------------------------------------------------------------
+Traceback (most recent call last):
+  File "040", line 445, in setUp
---
+socket.timeout: timed out
+
+======================================================================
+ERROR: testActiveWriteErrorIgnore (__main__.TestErrorHandling)
+----------------------------------------------------------------------
+Traceback (most recent call last):
+  File "040", line 445, in setUp
---
+socket.timeout: timed out
+
+======================================================================
+ERROR: testActiveWriteErrorReport (__main__.TestErrorHandling)
+----------------------------------------------------------------------
+Traceback (most recent call last):
+  File "040", line 445, in setUp
---
+socket.timeout: timed out
+
+======================================================================
+ERROR: testActiveWriteErrorStop (__main__.TestErrorHandling)
+----------------------------------------------------------------------
+Traceback (most recent call last):
+  File "040", line 445, in setUp
---
+socket.timeout: timed out
+
+======================================================================
+ERROR: testIntermediateReadErrorIgnore (__main__.TestErrorHandling)
+----------------------------------------------------------------------
+Traceback (most recent call last):
+  File "040", line 445, in setUp
---
+socket.timeout: timed out
+
+======================================================================
+ERROR: testIntermediateReadErrorReport (__main__.TestErrorHandling)
+----------------------------------------------------------------------
+Traceback (most recent call last):
+  File "040", line 445, in setUp
---
+socket.timeout: timed out
+
+======================================================================
+ERROR: testIntermediateReadErrorStop (__main__.TestErrorHandling)
+----------------------------------------------------------------------
+Traceback (most recent call last):
+  File "040", line 445, in setUp
---
+socket.timeout: timed out
+
+======================================================================
+ERROR: testIntermediateWriteErrorIgnore (__main__.TestErrorHandling)
+----------------------------------------------------------------------
+Traceback (most recent call last):
+  File "040", line 445, in setUp
---
+socket.timeout: timed out
+
+======================================================================
+ERROR: testIntermediateWriteErrorReport (__main__.TestErrorHandling)
+----------------------------------------------------------------------
+Traceback (most recent call last):
+  File "040", line 445, in setUp
---
+socket.timeout: timed out
+
+======================================================================
+ERROR: testIntermediateWriteErrorStop (__main__.TestErrorHandling)
+----------------------------------------------------------------------
+Traceback (most recent call last):
+  File "040", line 445, in setUp
---
+socket.timeout: timed out
+
+======================================================================
+ERROR: test_base_invalid (__main__.TestRelativePaths)
+----------------------------------------------------------------------
+Traceback (most recent call last):
+  File "040", line 315, in setUp
---
+socket.timeout: timed out
+
+======================================================================
+ERROR: test_commit (__main__.TestRelativePaths)
+----------------------------------------------------------------------
+Traceback (most recent call last):
+  File "040", line 315, in setUp
---
+socket.timeout: timed out
+
+======================================================================
+ERROR: test_device_not_found (__main__.TestRelativePaths)
+----------------------------------------------------------------------
+Traceback (most recent call last):
+  File "040", line 315, in setUp
---
+socket.timeout: timed out
+
+======================================================================
+ERROR: test_top_and_base_reversed (__main__.TestRelativePaths)
+----------------------------------------------------------------------
+Traceback (most recent call last):
+  File "040", line 315, in setUp
---
+socket.timeout: timed out
+
+======================================================================
+ERROR: test_top_invalid (__main__.TestRelativePaths)
+----------------------------------------------------------------------
+Traceback (most recent call last):
+  File "040", line 315, in setUp
---
+socket.timeout: timed out
+
+======================================================================
+ERROR: test_top_is_active (__main__.TestRelativePaths)
+----------------------------------------------------------------------
+Traceback (most recent call last):
+  File "040", line 315, in setUp
---
+socket.timeout: timed out
+
+======================================================================
+ERROR: test_top_same_base (__main__.TestRelativePaths)
+----------------------------------------------------------------------
+Traceback (most recent call last):
+  File "040", line 315, in setUp
---
+socket.timeout: timed out
+
+======================================================================
+ERROR: test_reopen_overlay (__main__.TestReopenOverlay)
+----------------------------------------------------------------------
+Traceback (most recent call last):
+  File "040", line 418, in setUp
---
+socket.timeout: timed out
+
+======================================================================
+ERROR: test_set_speed (__main__.TestSetSpeed)
+----------------------------------------------------------------------
+Traceback (most recent call last):
+  File "040", line 379, in setUp
---
+socket.timeout: timed out
+
+======================================================================
+ERROR: test_base_invalid (__main__.TestSingleDrive)
+----------------------------------------------------------------------
+Traceback (most recent call last):
+  File "040", line 90, in setUp
---
+socket.timeout: timed out
+
+======================================================================
+ERROR: test_base_node_invalid (__main__.TestSingleDrive)
+----------------------------------------------------------------------
+Traceback (most recent call last):
+  File "040", line 90, in setUp
---
+socket.timeout: timed out
+
+======================================================================
+ERROR: test_base_path_and_node (__main__.TestSingleDrive)
+----------------------------------------------------------------------
+Traceback (most recent call last):
+  File "040", line 90, in setUp
---
+socket.timeout: timed out
+
+======================================================================
+ERROR: test_commit (__main__.TestSingleDrive)
+----------------------------------------------------------------------
+Traceback (most recent call last):
+  File "040", line 90, in setUp
---
+socket.timeout: timed out
+
+======================================================================
+ERROR: test_commit_node (__main__.TestSingleDrive)
+----------------------------------------------------------------------
+Traceback (most recent call last):
+  File "040", line 90, in setUp
---
+socket.timeout: timed out
+
+======================================================================
+ERROR: test_commit_plus_filter_and_quit (__main__.TestSingleDrive)
+----------------------------------------------------------------------
+Traceback (most recent call last):
+  File "040", line 90, in setUp
---
+socket.timeout: timed out
+
+======================================================================
+ERROR: test_commit_with_filter_and_quit (__main__.TestSingleDrive)
+----------------------------------------------------------------------
+Traceback (most recent call last):
+  File "040", line 90, in setUp
---
+socket.timeout: timed out
+
+======================================================================
+ERROR: test_device_not_found (__main__.TestSingleDrive)
+----------------------------------------------------------------------
+Traceback (most recent call last):
+  File "040", line 90, in setUp
---
+socket.timeout: timed out
+
+======================================================================
+ERROR: test_hot_unplug (__main__.TestSingleDrive)
+----------------------------------------------------------------------
+Traceback (most recent call last):
+  File "040", line 90, in setUp
---
+socket.timeout: timed out
+
+======================================================================
+ERROR: test_implicit_node (__main__.TestSingleDrive)
+----------------------------------------------------------------------
+Traceback (most recent call last):
+  File "040", line 90, in setUp
---
+socket.timeout: timed out
+
+======================================================================
+ERROR: test_top_and_base_node_reversed (__main__.TestSingleDrive)
+----------------------------------------------------------------------
+Traceback (most recent call last):
+  File "040", line 90, in setUp
---
+socket.timeout: timed out
+
+======================================================================
+ERROR: test_top_and_base_reversed (__main__.TestSingleDrive)
+----------------------------------------------------------------------
+Traceback (most recent call last):
+  File "040", line 90, in setUp
---
+socket.timeout: timed out
+
+======================================================================
+ERROR: test_top_invalid (__main__.TestSingleDrive)
+----------------------------------------------------------------------
+Traceback (most recent call last):
+  File "040", line 90, in setUp
---
+socket.timeout: timed out
+
+======================================================================
+ERROR: test_top_is_active (__main__.TestSingleDrive)
+----------------------------------------------------------------------
+Traceback (most recent call last):
+  File "040", line 90, in setUp
---
+socket.timeout: timed out
+
+======================================================================
+ERROR: test_top_is_default_active (__main__.TestSingleDrive)
+----------------------------------------------------------------------
+Traceback (most recent call last):
+  File "040", line 90, in setUp
---
+socket.timeout: timed out
+
+======================================================================
+ERROR: test_top_node_in_wrong_chain (__main__.TestSingleDrive)
+----------------------------------------------------------------------
+Traceback (most recent call last):
+  File "040", line 90, in setUp
---
+socket.timeout: timed out
+
+======================================================================
+ERROR: test_top_node_invalid (__main__.TestSingleDrive)
+----------------------------------------------------------------------
+Traceback (most recent call last):
+  File "040", line 90, in setUp
---
+socket.timeout: timed out
+
+======================================================================
+ERROR: test_top_path_and_node (__main__.TestSingleDrive)
+----------------------------------------------------------------------
+Traceback (most recent call last):
+  File "040", line 90, in setUp
---
+socket.timeout: timed out
+
+======================================================================
+ERROR: test_top_same_base (__main__.TestSingleDrive)
+----------------------------------------------------------------------
+Traceback (most recent call last):
+  File "040", line 90, in setUp
---
 Ran 59 tests
 
-OK
+FAILED (errors=59)
    [case not run] test_after_a_quorum_snapshot (__main__.TestRepairQuorum): formats ['quorum'] are not whitelisted
    [case not run] test_cancel (__main__.TestRepairQuorum): formats ['quorum'] are not whitelisted
    [case not run] test_cancel_after_ready (__main__.TestRepairQuorum): formats ['quorum'] are not whitelisted
---
+++ /tmp/qemu-test/build/tests/qemu-iotests/041.out.bad 2020-06-30 13:40:21.932552604 +0000
@@ -1,5 +1,1991 @@
-........................................................................................................
+WARNING:qemu.machine:qemu received signal 6: /tmp/qemu-test/build/tests/qemu-iotests/../../x86_64-softmmu/qemu-system-x86_64 -display none -vga none -chardev socket,id=mon,path=/tmp/tmp.6XQrnYb2wb/qemu-19716-monitor.sock -mon chardev=mon,mode=control -qtest unix:path=/tmp/tmp.6XQrnYb2wb/qemu-19716-qtest.sock -accel qtest -nodefaults -display none -accel qtest -drive if=virtio,id=drive0,file=/tmp/qemu-test/test.img,format=qcow2,cache=writeback,aio=threads
+WARNING:qemu.machine:qemu received signal 6: /tmp/qemu-test/build/tests/qemu-iotests/../../x86_64-softmmu/qemu-system-x86_64 -display none -vga none -chardev socket,id=mon,path=/tmp/tmp.6XQrnYb2wb/qemu-19716-monitor.sock -mon chardev=mon,mode=control -qtest unix:path=/tmp/tmp.6XQrnYb2wb/qemu-19716-qtest.sock -accel qtest -nodefaults -display none -accel qtest -drive if=virtio,id=drive0,file=/tmp/qemu-test/test.img,format=qcow2,cache=writeback,aio=threads
+WARNING:qemu.machine:qemu received signal 6: /tmp/qemu-test/build/tests/qemu-iotests/../../x86_64-softmmu/qemu-system-x86_64 -display none -vga none -chardev socket,id=mon,path=/tmp/tmp.6XQrnYb2wb/qemu-19716-monitor.sock -mon chardev=mon,mode=control -qtest unix:path=/tmp/tmp.6XQrnYb2wb/qemu-19716-qtest.sock -accel qtest -nodefaults -display none -accel qtest -drive if=virtio,id=drive0,file=/tmp/qemu-test/test.img,format=qcow2,cache=writeback,aio=threads
+WARNING:qemu.machine:qemu received signal 6: /tmp/qemu-test/build/tests/qemu-iotests/../../x86_64-softmmu/qemu-system-x86_64 -display none -vga none -chardev socket,id=mon,path=/tmp/tmp.6XQrnYb2wb/qemu-19716-monitor.sock -mon chardev=mon,mode=control -qtest unix:path=/tmp/tmp.6XQrnYb2wb/qemu-19716-qtest.sock -accel qtest -nodefaults -display none -accel qtest -drive if=virtio,id=drive0,file=/tmp/qemu-test/test.img,format=qcow2,cache=writeback,aio=threads
+WARNING:qemu.machine:qemu received signal 6: /tmp/qemu-test/build/tests/qemu-iotests/../../x86_64-softmmu/qemu-system-x86_64 -display none -vga none -chardev socket,id=mon,path=/tmp/tmp.6XQrnYb2wb/qemu-19716-monitor.sock -mon chardev=mon,mode=control -qtest unix:path=/tmp/tmp.6XQrnYb2wb/qemu-19716-qtest.sock -accel qtest -nodefaults -display none -accel qtest -drive if=virtio,id=drive0,file=/tmp/qemu-test/test.img,format=qcow2,cache=writeback,aio=threads
+WARNING:qemu.machine:qemu received signal 6: /tmp/qemu-test/build/tests/qemu-iotests/../../x86_64-softmmu/qemu-system-x86_64 -display none -vga none -chardev socket,id=mon,path=/tmp/tmp.6XQrnYb2wb/qemu-19716-monitor.sock -mon chardev=mon,mode=control -qtest unix:path=/tmp/tmp.6XQrnYb2wb/qemu-19716-qtest.sock -accel qtest -nodefaults -display none -accel qtest -drive if=virtio,id=drive0,file=/tmp/qemu-test/test.img,format=qcow2,cache=writeback,aio=threads
+WARNING:qemu.machine:qemu received signal 6: /tmp/qemu-test/build/tests/qemu-iotests/../../x86_64-softmmu/qemu-system-x86_64 -display none -vga none -chardev socket,id=mon,path=/tmp/tmp.6XQrnYb2wb/qemu-19716-monitor.sock -mon chardev=mon,mode=control -qtest unix:path=/tmp/tmp.6XQrnYb2wb/qemu-19716-qtest.sock -accel qtest -nodefaults -display none -accel qtest -blockdev node-name=src,driver=null-co -blockdev node-name=dest,driver=null-co -blockdev node-name=dest-ro,driver=null-co,read-only=on
+WARNING:qemu.machine:qemu received signal 6: /tmp/qemu-test/build/tests/qemu-iotests/../../x86_64-softmmu/qemu-system-x86_64 -display none -vga none -chardev socket,id=mon,path=/tmp/tmp.6XQrnYb2wb/qemu-19716-monitor.sock -mon chardev=mon,mode=control -qtest unix:path=/tmp/tmp.6XQrnYb2wb/qemu-19716-qtest.sock -accel qtest -nodefaults -display none -accel qtest -blockdev node-name=src,driver=null-co -blockdev node-name=dest,driver=null-co -blockdev node-name=dest-ro,driver=null-co,read-only=on
+WARNING:qemu.machine:qemu received signal 6: /tmp/qemu-test/build/tests/qemu-iotests/../../x86_64-softmmu/qemu-system-x86_64 -display none -vga none -chardev socket,id=mon,path=/tmp/tmp.6XQrnYb2wb/qemu-19716-monitor.sock -mon chardev=mon,mode=control -qtest unix:path=/tmp/tmp.6XQrnYb2wb/qemu-19716-qtest.sock -accel qtest -nodefaults -display none -accel qtest -blockdev node-name=src,driver=null-co -blockdev node-name=dest,driver=null-co -blockdev node-name=dest-ro,driver=null-co,read-only=on
+WARNING:qemu.machine:qemu received signal 6: /tmp/qemu-test/build/tests/qemu-iotests/../../x86_64-softmmu/qemu-system-x86_64 -display none -vga none -chardev socket,id=mon,path=/tmp/tmp.6XQrnYb2wb/qemu-19716-monitor.sock -mon chardev=mon,mode=control -qtest unix:path=/tmp/tmp.6XQrnYb2wb/qemu-19716-qtest.sock -accel qtest -nodefaults -display none -accel qtest -blockdev node-name=src,driver=null-co -blockdev node-name=dest,driver=null-co -blockdev node-name=dest-ro,driver=null-co,read-only=on
+WARNING:qemu.machine:qemu received signal 6: /tmp/qemu-test/build/tests/qemu-iotests/../../x86_64-softmmu/qemu-system-x86_64 -display none -vga none -chardev socket,id=mon,path=/tmp/tmp.6XQrnYb2wb/qemu-19716-monitor.sock -mon chardev=mon,mode=control -qtest unix:path=/tmp/tmp.6XQrnYb2wb/qemu-19716-qtest.sock -accel qtest -nodefaults -display none -accel qtest -drive if=virtio,id=drive0,file=/tmp/qemu-test/test.img,format=qcow2,cache=writeback,aio=threads
+WARNING:qemu.machine:qemu received signal 6: /tmp/qemu-test/build/tests/qemu-iotests/../../x86_64-softmmu/qemu-system-x86_64 -display none -vga none -chardev socket,id=mon,path=/tmp/tmp.6XQrnYb2wb/qemu-19716-monitor.sock -mon chardev=mon,mode=control -qtest unix:path=/tmp/tmp.6XQrnYb2wb/qemu-19716-qtest.sock -accel qtest -nodefaults -display none -accel qtest -drive if=virtio,id=drive0,file=/tmp/qemu-test/test.img,format=qcow2,cache=writeback,aio=threads
+WARNING:qemu.machine:qemu received signal 6: /tmp/qemu-test/build/tests/qemu-iotests/../../x86_64-softmmu/qemu-system-x86_64 -display none -vga none -chardev socket,id=mon,path=/tmp/tmp.6XQrnYb2wb/qemu-19716-monitor.sock -mon chardev=mon,mode=control -qtest unix:path=/tmp/tmp.6XQrnYb2wb/qemu-19716-qtest.sock -accel qtest -nodefaults -display none -accel qtest -drive if=virtio,id=drive0,file=/tmp/qemu-test/test.img,format=qcow2,cache=writeback,aio=threads
+WARNING:qemu.machine:qemu received signal 6: /tmp/qemu-test/build/tests/qemu-iotests/../../x86_64-softmmu/qemu-system-x86_64 -display none -vga none -chardev socket,id=mon,path=/tmp/tmp.6XQrnYb2wb/qemu-19716-monitor.sock -mon chardev=mon,mode=control -qtest unix:path=/tmp/tmp.6XQrnYb2wb/qemu-19716-qtest.sock -accel qtest -nodefaults -display none -accel qtest -drive if=virtio,id=drive0,file=/tmp/qemu-test/test.img,format=qcow2,cache=writeback,aio=threads
+qemu received signal 6: /tmp/qemu-test/build/tests/qemu-iotests/../../x86_64-softmmu/qemu-system-x86_64 -nodefaults -display none -accel qtest -drive format=help
+WARNING:qemu.machine:qemu received signal 6: /tmp/qemu-test/build/tests/qemu-iotests/../../x86_64-softmmu/qemu-system-x86_64 -display none -vga none -chardev socket,id=mon,path=/tmp/tmp.6XQrnYb2wb/qemu-19716-monitor.sock -mon chardev=mon,mode=control -qtest unix:path=/tmp/tmp.6XQrnYb2wb/qemu-19716-qtest.sock -accel qtest -nodefaults -display none -accel qtest
+WARNING:qemu.machine:qemu received signal 6: /tmp/qemu-test/build/tests/qemu-iotests/../../x86_64-softmmu/qemu-system-x86_64 -display none -vga none -chardev socket,id=mon,path=/tmp/tmp.6XQrnYb2wb/qemu-19716-monitor.sock -mon chardev=mon,mode=control -qtest unix:path=/tmp/tmp.6XQrnYb2wb/qemu-19716-qtest.sock -accel qtest -nodefaults -display none -accel qtest -drive if=virtio,id=drive0,file=/tmp/qemu-test/test.img,format=qcow2,cache=writeback,aio=threads
+WARNING:qemu.machine:qemu received signal 6: /tmp/qemu-test/build/tests/qemu-iotests/../../x86_64-softmmu/qemu-system-x86_64 -display none -vga none -chardev socket,id=mon,path=/tmp/tmp.6XQrnYb2wb/qemu-19716-monitor.sock -mon chardev=mon,mode=control -qtest unix:path=/tmp/tmp.6XQrnYb2wb/qemu-19716-qtest.sock -accel qtest -nodefaults -display none -accel qtest -drive if=virtio,id=drive0,file=/tmp/qemu-test/test.img,format=qcow2,cache=writeback,aio=threads
+WARNING:qemu.machine:qemu received signal 6: /tmp/qemu-test/build/tests/qemu-iotests/../../x86_64-softmmu/qemu-system-x86_64 -display none -vga none -chardev socket,id=mon,path=/tmp/tmp.6XQrnYb2wb/qemu-19716-monitor.sock -mon chardev=mon,mode=control -qtest unix:path=/tmp/tmp.6XQrnYb2wb/qemu-19716-qtest.sock -accel qtest -nodefaults -display none -accel qtest -drive if=virtio,id=drive0,file=/tmp/qemu-test/test.img,format=qcow2,cache=writeback,aio=threads,node-name=top,backing.node-name=base -drive if=ide,id=drive1,media=cdrom
+WARNING:qemu.machine:qemu received signal 6: /tmp/qemu-test/build/tests/qemu-iotests/../../x86_64-softmmu/qemu-system-x86_64 -display none -vga none -chardev socket,id=mon,path=/tmp/tmp.6XQrnYb2wb/qemu-19716-monitor.sock -mon chardev=mon,mode=control -qtest unix:path=/tmp/tmp.6XQrnYb2wb/qemu-19716-qtest.sock -accel qtest -nodefaults -display none -accel qtest -drive if=virtio,id=drive0,file=/tmp/qemu-test/test.img,format=qcow2,cache=writeback,aio=threads,node-name=top,backing.node-name=base -drive if=ide,id=drive1,media=cdrom
+WARNING:qemu.machine:qemu received signal 6: /tmp/qemu-test/build/tests/qemu-iotests/../../x86_64-softmmu/qemu-system-x86_64 -display none -vga none -chardev socket,id=mon,path=/tmp/tmp.6XQrnYb2wb/qemu-19716-monitor.sock -mon chardev=mon,mode=control -qtest unix:path=/tmp/tmp.6XQrnYb2wb/qemu-19716-qtest.sock -accel qtest -nodefaults -display none -accel qtest -drive if=virtio,id=drive0,file=/tmp/qemu-test/test.img,format=qcow2,cache=writeback,aio=threads,node-name=top,backing.node-name=base -drive if=ide,id=drive1,media=cdrom
+WARNING:qemu.machine:qemu received signal 6: /tmp/qemu-test/build/tests/qemu-iotests/../../x86_64-softmmu/qemu-system-x86_64 -display none -vga none -chardev socket,id=mon,path=/tmp/tmp.6XQrnYb2wb/qemu-19716-monitor.sock -mon chardev=mon,mode=control -qtest unix:path=/tmp/tmp.6XQrnYb2wb/qemu-19716-qtest.sock -accel qtest -nodefaults -display none -accel qtest -drive if=virtio,id=drive0,file=/tmp/qemu-test/test.img,format=qcow2,cache=writeback,aio=threads,node-name=top,backing.node-name=base -drive if=ide,id=drive1,media=cdrom
+WARNING:qemu.machine:qemu received signal 6: /tmp/qemu-test/build/tests/qemu-iotests/../../x86_64-softmmu/qemu-system-x86_64 -display none -vga none -chardev socket,id=mon,path=/tmp/tmp.6XQrnYb2wb/qemu-19716-monitor.sock -mon chardev=mon,mode=control -qtest unix:path=/tmp/tmp.6XQrnYb2wb/qemu-19716-qtest.sock -accel qtest -nodefaults -display none -accel qtest -drive if=virtio,id=drive0,file=/tmp/qemu-test/test.img,format=qcow2,cache=writeback,aio=threads,node-name=top,backing.node-name=base -drive if=ide,id=drive1,media=cdrom
+WARNING:qemu.machine:qemu received signal 6: /tmp/qemu-test/build/tests/qemu-iotests/../../x86_64-softmmu/qemu-system-x86_64 -display none -vga none -chardev socket,id=mon,path=/tmp/tmp.6XQrnYb2wb/qemu-19716-monitor.sock -mon chardev=mon,mode=control -qtest unix:path=/tmp/tmp.6XQrnYb2wb/qemu-19716-qtest.sock -accel qtest -nodefaults -display none -accel qtest -drive if=virtio,id=drive0,file=/tmp/qemu-test/test.img,format=qcow2,cache=writeback,aio=threads,node-name=top,backing.node-name=base -drive if=ide,id=drive1,media=cdrom
+WARNING:qemu.machine:qemu received signal 6: /tmp/qemu-test/build/tests/qemu-iotests/../../x86_64-softmmu/qemu-system-x86_64 -display none -vga none -chardev socket,id=mon,path=/tmp/tmp.6XQrnYb2wb/qemu-19716-monitor.sock -mon chardev=mon,mode=control -qtest unix:path=/tmp/tmp.6XQrnYb2wb/qemu-19716-qtest.sock -accel qtest -nodefaults -display none -accel qtest -drive if=virtio,id=drive0,file=/tmp/qemu-test/test.img,format=qcow2,cache=writeback,aio=threads,node-name=top,backing.node-name=base -drive if=ide,id=drive1,media=cdrom
+WARNING:qemu.machine:qemu received signal 6: /tmp/qemu-test/build/tests/qemu-iotests/../../x86_64-softmmu/qemu-system-x86_64 -display none -vga none -chardev socket,id=mon,path=/tmp/tmp.6XQrnYb2wb/qemu-19716-monitor.sock -mon chardev=mon,mode=control -qtest unix:path=/tmp/tmp.6XQrnYb2wb/qemu-19716-qtest.sock -accel qtest -nodefaults -display none -accel qtest -drive if=virtio,id=drive0,file=/tmp/qemu-test/test.img,format=qcow2,cache=writeback,aio=threads,node-name=top,backing.node-name=base -drive if=ide,id=drive1,media=cdrom
+WARNING:qemu.machine:qemu received signal 6: /tmp/qemu-test/build/tests/qemu-iotests/../../x86_64-softmmu/qemu-system-x86_64 -display none -vga none -chardev socket,id=mon,path=/tmp/tmp.6XQrnYb2wb/qemu-19716-monitor.sock -mon chardev=mon,mode=control -qtest unix:path=/tmp/tmp.6XQrnYb2wb/qemu-19716-qtest.sock -accel qtest -nodefaults -display none -accel qtest -drive if=virtio,id=drive0,file=/tmp/qemu-test/test.img,format=qcow2,cache=writeback,aio=threads,node-name=top,backing.node-name=base -drive if=ide,id=drive1,media=cdrom
+WARNING:qemu.machine:qemu received signal 6: /tmp/qemu-test/build/tests/qemu-iotests/../../x86_64-softmmu/qemu-system-x86_64 -display none -vga none -chardev socket,id=mon,path=/tmp/tmp.6XQrnYb2wb/qemu-19716-monitor.sock -mon chardev=mon,mode=control -qtest unix:path=/tmp/tmp.6XQrnYb2wb/qemu-19716-qtest.sock -accel qtest -nodefaults -display none -accel qtest -drive if=virtio,id=drive0,file=/tmp/qemu-test/test.img,format=qcow2,cache=writeback,aio=threads,node-name=top,backing.node-name=base -drive if=ide,id=drive1,media=cdrom
+WARNING:qemu.machine:qemu received signal 6: /tmp/qemu-test/build/tests/qemu-iotests/../../x86_64-softmmu/qemu-system-x86_64 -display none -vga none -chardev socket,id=mon,path=/tmp/tmp.6XQrnYb2wb/qemu-19716-monitor.sock -mon chardev=mon,mode=control -qtest unix:path=/tmp/tmp.6XQrnYb2wb/qemu-19716-qtest.sock -accel qtest -nodefaults -display none -accel qtest -drive if=virtio,id=drive0,file=/tmp/qemu-test/test.img,format=qcow2,cache=writeback,aio=threads,node-name=top,backing.node-name=base -drive if=ide,id=drive1,media=cdrom
+WARNING:qemu.machine:qemu received signal 6: /tmp/qemu-test/build/tests/qemu-iotests/../../x86_64-softmmu/qemu-system-x86_64 -display none -vga none -chardev socket,id=mon,path=/tmp/tmp.6XQrnYb2wb/qemu-19716-monitor.sock -mon chardev=mon,mode=control -qtest unix:path=/tmp/tmp.6XQrnYb2wb/qemu-19716-qtest.sock -accel qtest -nodefaults -display none -accel qtest -drive if=virtio,id=drive0,file=/tmp/qemu-test/test.img,format=qcow2,cache=writeback,aio=threads,node-name=top,backing.node-name=base -drive if=ide,id=drive1,media=cdrom
+WARNING:qemu.machine:qemu received signal 6: /tmp/qemu-test/build/tests/qemu-iotests/../../x86_64-softmmu/qemu-system-x86_64 -display none -vga none -chardev socket,id=mon,path=/tmp/tmp.6XQrnYb2wb/qemu-19716-monitor.sock -mon chardev=mon,mode=control -qtest unix:path=/tmp/tmp.6XQrnYb2wb/qemu-19716-qtest.sock -accel qtest -nodefaults -display none -accel qtest -drive if=virtio,id=drive0,file=/tmp/qemu-test/test.img,format=qcow2,cache=writeback,aio=threads,node-name=top,backing.node-name=base -drive if=ide,id=drive1,media=cdrom
+WARNING:qemu.machine:qemu received signal 6: /tmp/qemu-test/build/tests/qemu-iotests/../../x86_64-softmmu/qemu-system-x86_64 -display none -vga none -chardev socket,id=mon,path=/tmp/tmp.6XQrnYb2wb/qemu-19716-monitor.sock -mon chardev=mon,mode=control -qtest unix:path=/tmp/tmp.6XQrnYb2wb/qemu-19716-qtest.sock -accel qtest -nodefaults -display none -accel qtest -drive if=virtio,id=drive0,file=/tmp/qemu-test/test.img,format=qcow2,cache=writeback,aio=threads,node-name=top,backing.node-name=base -drive if=ide,id=drive1,media=cdrom
+WARNING:qemu.machine:qemu received signal 6: /tmp/qemu-test/build/tests/qemu-iotests/../../x86_64-softmmu/qemu-system-x86_64 -display none -vga none -chardev socket,id=mon,path=/tmp/tmp.6XQrnYb2wb/qemu-19716-monitor.sock -mon chardev=mon,mode=control -qtest unix:path=/tmp/tmp.6XQrnYb2wb/qemu-19716-qtest.sock -accel qtest -nodefaults -display none -accel qtest -drive if=virtio,id=drive0,file=/tmp/qemu-test/test.img,format=qcow2,cache=writeback,aio=threads,node-name=top,backing.node-name=base -drive if=ide,id=drive1,media=cdrom
+WARNING:qemu.machine:qemu received signal 6: /tmp/qemu-test/build/tests/qemu-iotests/../../x86_64-softmmu/qemu-system-x86_64 -display none -vga none -chardev socket,id=mon,path=/tmp/tmp.6XQrnYb2wb/qemu-19716-monitor.sock -mon chardev=mon,mode=control -qtest unix:path=/tmp/tmp.6XQrnYb2wb/qemu-19716-qtest.sock -accel qtest -nodefaults -display none -accel qtest -drive if=virtio,id=drive0,file=/tmp/qemu-test/test.img,format=qcow2,cache=writeback,aio=threads,node-name=top,backing.node-name=base -drive if=ide,id=drive1,media=cdrom
+WARNING:qemu.machine:qemu received signal 6: /tmp/qemu-test/build/tests/qemu-iotests/../../x86_64-softmmu/qemu-system-x86_64 -display none -vga none -chardev socket,id=mon,path=/tmp/tmp.6XQrnYb2wb/qemu-19716-monitor.sock -mon chardev=mon,mode=control -qtest unix:path=/tmp/tmp.6XQrnYb2wb/qemu-19716-qtest.sock -accel qtest -nodefaults -display none -accel qtest -drive if=virtio,id=drive0,file=/tmp/qemu-test/test.img,format=qcow2,cache=writeback,aio=threads,node-name=top,backing.node-name=base -drive if=ide,id=drive1,media=cdrom
+WARNING:qemu.machine:qemu received signal 6: /tmp/qemu-test/build/tests/qemu-iotests/../../x86_64-softmmu/qemu-system-x86_64 -display none -vga none -chardev socket,id=mon,path=/tmp/tmp.6XQrnYb2wb/qemu-19716-monitor.sock -mon chardev=mon,mode=control -qtest unix:path=/tmp/tmp.6XQrnYb2wb/qemu-19716-qtest.sock -accel qtest -nodefaults -display none -accel qtest -drive if=virtio,id=drive0,file=/tmp/qemu-test/test.img,format=qcow2,cache=writeback,aio=threads,node-name=top,backing.node-name=base -drive if=ide,id=drive1,media=cdrom
+WARNING:qemu.machine:qemu received signal 6: /tmp/qemu-test/build/tests/qemu-iotests/../../x86_64-softmmu/qemu-system-x86_64 -display none -vga none -chardev socket,id=mon,path=/tmp/tmp.6XQrnYb2wb/qemu-19716-monitor.sock -mon chardev=mon,mode=control -qtest unix:path=/tmp/tmp.6XQrnYb2wb/qemu-19716-qtest.sock -accel qtest -nodefaults -display none -accel qtest -drive if=virtio,id=drive0,file=/tmp/qemu-test/test.img,format=qcow2,cache=writeback,aio=threads,node-name=top,backing.node-name=base -drive if=ide,id=drive1,media=cdrom
+WARNING:qemu.machine:qemu received signal 6: /tmp/qemu-test/build/tests/qemu-iotests/../../x86_64-softmmu/qemu-system-x86_64 -display none -vga none -chardev socket,id=mon,path=/tmp/tmp.6XQrnYb2wb/qemu-19716-monitor.sock -mon chardev=mon,mode=control -qtest unix:path=/tmp/tmp.6XQrnYb2wb/qemu-19716-qtest.sock -accel qtest -nodefaults -display none -accel qtest -drive if=virtio,id=drive0,file=/tmp/qemu-test/test.img,format=qcow2,cache=writeback,aio=threads,node-name=top,backing.node-name=base -drive if=ide,id=drive1,media=cdrom
+WARNING:qemu.machine:qemu received signal 6: /tmp/qemu-test/build/tests/qemu-iotests/../../x86_64-softmmu/qemu-system-x86_64 -display none -vga none -chardev socket,id=mon,path=/tmp/tmp.6XQrnYb2wb/qemu-19716-monitor.sock -mon chardev=mon,mode=control -qtest unix:path=/tmp/tmp.6XQrnYb2wb/qemu-19716-qtest.sock -accel qtest -nodefaults -display none -accel qtest -drive if=virtio,id=drive0,file=/tmp/qemu-test/test.img,format=qcow2,cache=writeback,aio=threads,node-name=top,backing.node-name=base -drive if=ide,id=drive1,media=cdrom
+WARNING:qemu.machine:qemu received signal 6: /tmp/qemu-test/build/tests/qemu-iotests/../../x86_64-softmmu/qemu-system-x86_64 -display none -vga none -chardev socket,id=mon,path=/tmp/tmp.6XQrnYb2wb/qemu-19716-monitor.sock -mon chardev=mon,mode=control -qtest unix:path=/tmp/tmp.6XQrnYb2wb/qemu-19716-qtest.sock -accel qtest -nodefaults -display none -accel qtest -drive if=virtio,id=drive0,file=/tmp/qemu-test/test.img,format=qcow2,cache=writeback,aio=threads,node-name=top,backing.node-name=base -drive if=ide,id=drive1,media=cdrom
+WARNING:qemu.machine:qemu received signal 6: /tmp/qemu-test/build/tests/qemu-iotests/../../x86_64-softmmu/qemu-system-x86_64 -display none -vga none -chardev socket,id=mon,path=/tmp/tmp.6XQrnYb2wb/qemu-19716-monitor.sock -mon chardev=mon,mode=control -qtest unix:path=/tmp/tmp.6XQrnYb2wb/qemu-19716-qtest.sock -accel qtest -nodefaults -display none -accel qtest -drive if=virtio,id=drive0,file=/tmp/qemu-test/test.img,format=qcow2,cache=writeback,aio=threads,node-name=top,backing.node-name=base -drive if=ide,id=drive1,media=cdrom
+WARNING:qemu.machine:qemu received signal 6: /tmp/qemu-test/build/tests/qemu-iotests/../../x86_64-softmmu/qemu-system-x86_64 -display none -vga none -chardev socket,id=mon,path=/tmp/tmp.6XQrnYb2wb/qemu-19716-monitor.sock -mon chardev=mon,mode=control -qtest unix:path=/tmp/tmp.6XQrnYb2wb/qemu-19716-qtest.sock -accel qtest -nodefaults -display none -accel qtest -drive if=virtio,id=drive0,file=/tmp/qemu-test/test.img,format=qcow2,cache=writeback,aio=threads,node-name=top,backing.node-name=base -drive if=ide,id=drive1,media=cdrom
+WARNING:qemu.machine:qemu received signal 6: /tmp/qemu-test/build/tests/qemu-iotests/../../x86_64-softmmu/qemu-system-x86_64 -display none -vga none -chardev socket,id=mon,path=/tmp/tmp.6XQrnYb2wb/qemu-19716-monitor.sock -mon chardev=mon,mode=control -qtest unix:path=/tmp/tmp.6XQrnYb2wb/qemu-19716-qtest.sock -accel qtest -nodefaults -display none -accel qtest -drive if=virtio,id=drive0,file=/tmp/qemu-test/test.img,format=qcow2,cache=writeback,aio=threads,node-name=top,backing.node-name=base -drive if=ide,id=drive1,media=cdrom
+WARNING:qemu.machine:qemu received signal 6: /tmp/qemu-test/build/tests/qemu-iotests/../../x86_64-softmmu/qemu-system-x86_64 -display none -vga none -chardev socket,id=mon,path=/tmp/tmp.6XQrnYb2wb/qemu-19716-monitor.sock -mon chardev=mon,mode=control -qtest unix:path=/tmp/tmp.6XQrnYb2wb/qemu-19716-qtest.sock -accel qtest -nodefaults -display none -accel qtest -drive if=virtio,id=drive0,file=/tmp/qemu-test/test.img,format=qcow2,cache=writeback,aio=threads,node-name=top,backing.node-name=base -drive if=ide,id=drive1,media=cdrom
+WARNING:qemu.machine:qemu received signal 6: /tmp/qemu-test/build/tests/qemu-iotests/../../x86_64-softmmu/qemu-system-x86_64 -display none -vga none -chardev socket,id=mon,path=/tmp/tmp.6XQrnYb2wb/qemu-19716-monitor.sock -mon chardev=mon,mode=control -qtest unix:path=/tmp/tmp.6XQrnYb2wb/qemu-19716-qtest.sock -accel qtest -nodefaults -display none -accel qtest -drive if=virtio,id=drive0,file=/tmp/qemu-test/test.img,format=qcow2,cache=writeback,aio=threads,node-name=top,backing.node-name=base -drive if=ide,id=drive1,media=cdrom
+WARNING:qemu.machine:qemu received signal 6: /tmp/qemu-test/build/tests/qemu-iotests/../../x86_64-softmmu/qemu-system-x86_64 -display none -vga none -chardev socket,id=mon,path=/tmp/tmp.6XQrnYb2wb/qemu-19716-monitor.sock -mon chardev=mon,mode=control -qtest unix:path=/tmp/tmp.6XQrnYb2wb/qemu-19716-qtest.sock -accel qtest -nodefaults -display none -accel qtest -drive if=virtio,id=drive0,file=/tmp/qemu-test/test.img,format=qcow2,cache=writeback,aio=threads,node-name=top,backing.node-name=base -drive if=ide,id=drive1,media=cdrom
+WARNING:qemu.machine:qemu received signal 6: /tmp/qemu-test/build/tests/qemu-iotests/../../x86_64-softmmu/qemu-system-x86_64 -display none -vga none -chardev socket,id=mon,path=/tmp/tmp.6XQrnYb2wb/qemu-19716-monitor.sock -mon chardev=mon,mode=control -qtest unix:path=/tmp/tmp.6XQrnYb2wb/qemu-19716-qtest.sock -accel qtest -nodefaults -display none -accel qtest -drive if=virtio,id=drive0,file=/tmp/qemu-test/test.img,format=qcow2,cache=writeback,aio=threads,node-name=top,backing.node-name=base -drive if=ide,id=drive1,media=cdrom
+WARNING:qemu.machine:qemu received signal 6: /tmp/qemu-test/build/tests/qemu-iotests/../../x86_64-softmmu/qemu-system-x86_64 -display none -vga none -chardev socket,id=mon,path=/tmp/tmp.6XQrnYb2wb/qemu-19716-monitor.sock -mon chardev=mon,mode=control -qtest unix:path=/tmp/tmp.6XQrnYb2wb/qemu-19716-qtest.sock -accel qtest -nodefaults -display none -accel qtest -drive if=virtio,id=drive0,file=/tmp/qemu-test/test.img,format=qcow2,cache=writeback,aio=threads,node-name=top,backing.node-name=base -drive if=ide,id=drive1,media=cdrom
+WARNING:qemu.machine:qemu received signal 6: /tmp/qemu-test/build/tests/qemu-iotests/../../x86_64-softmmu/qemu-system-x86_64 -display none -vga none -chardev socket,id=mon,path=/tmp/tmp.6XQrnYb2wb/qemu-19716-monitor.sock -mon chardev=mon,mode=control -qtest unix:path=/tmp/tmp.6XQrnYb2wb/qemu-19716-qtest.sock -accel qtest -nodefaults -display none -accel qtest -drive if=virtio,id=drive0,file=/tmp/qemu-test/test.img,format=qcow2,cache=writeback,aio=threads,node-name=top,backing.node-name=base -drive if=ide,id=drive1,media=cdrom
+WARNING:qemu.machine:qemu received signal 6: /tmp/qemu-test/build/tests/qemu-iotests/../../x86_64-softmmu/qemu-system-x86_64 -display none -vga none -chardev socket,id=mon,path=/tmp/tmp.6XQrnYb2wb/qemu-19716-monitor.sock -mon chardev=mon,mode=control -qtest unix:path=/tmp/tmp.6XQrnYb2wb/qemu-19716-qtest.sock -accel qtest -nodefaults -display none -accel qtest -drive if=virtio,id=drive0,file=/tmp/qemu-test/test.img,format=qcow2,cache=writeback,aio=threads,node-name=top,backing.node-name=base -drive if=ide,id=drive1,media=cdrom
+WARNING:qemu.machine:qemu received signal 6: /tmp/qemu-test/build/tests/qemu-iotests/../../x86_64-softmmu/qemu-system-x86_64 -display none -vga none -chardev socket,id=mon,path=/tmp/tmp.6XQrnYb2wb/qemu-19716-monitor.sock -mon chardev=mon,mode=control -qtest unix:path=/tmp/tmp.6XQrnYb2wb/qemu-19716-qtest.sock -accel qtest -nodefaults -display none -accel qtest -drive if=virtio,id=drive0,file=/tmp/qemu-test/test.img,format=qcow2,cache=writeback,aio=threads,node-name=top,backing.node-name=base -drive if=ide,id=drive1,media=cdrom
+WARNING:qemu.machine:qemu received signal 6: /tmp/qemu-test/build/tests/qemu-iotests/../../x86_64-softmmu/qemu-system-x86_64 -display none -vga none -chardev socket,id=mon,path=/tmp/tmp.6XQrnYb2wb/qemu-19716-monitor.sock -mon chardev=mon,mode=control -qtest unix:path=/tmp/tmp.6XQrnYb2wb/qemu-19716-qtest.sock -accel qtest -nodefaults -display none -accel qtest -drive if=virtio,id=drive0,file=/tmp/qemu-test/test.img,format=qcow2,cache=writeback,aio=threads,node-name=top,backing.node-name=base -drive if=ide,id=drive1,media=cdrom
+WARNING:qemu.machine:qemu received signal 6: /tmp/qemu-test/build/tests/qemu-iotests/../../x86_64-softmmu/qemu-system-x86_64 -display none -vga none -chardev socket,id=mon,path=/tmp/tmp.6XQrnYb2wb/qemu-19716-monitor.sock -mon chardev=mon,mode=control -qtest unix:path=/tmp/tmp.6XQrnYb2wb/qemu-19716-qtest.sock -accel qtest -nodefaults -display none -accel qtest -drive if=virtio,id=drive0,file=/tmp/qemu-test/test.img,format=qcow2,cache=writeback,aio=threads,node-name=top,backing.node-name=base -drive if=ide,id=drive1,media=cdrom
+WARNING:qemu.machine:qemu received signal 6: /tmp/qemu-test/build/tests/qemu-iotests/../../x86_64-softmmu/qemu-system-x86_64 -display none -vga none -chardev socket,id=mon,path=/tmp/tmp.6XQrnYb2wb/qemu-19716-monitor.sock -mon chardev=mon,mode=control -qtest unix:path=/tmp/tmp.6XQrnYb2wb/qemu-19716-qtest.sock -accel qtest -nodefaults -display none -accel qtest -drive if=virtio,id=drive0,file=/tmp/qemu-test/test.img,format=qcow2,cache=writeback,aio=threads,node-name=top,backing.node-name=base -drive if=ide,id=drive1,media=cdrom
+WARNING:qemu.machine:qemu received signal 6: /tmp/qemu-test/build/tests/qemu-iotests/../../x86_64-softmmu/qemu-system-x86_64 -display none -vga none -chardev socket,id=mon,path=/tmp/tmp.6XQrnYb2wb/qemu-19716-monitor.sock -mon chardev=mon,mode=control -qtest unix:path=/tmp/tmp.6XQrnYb2wb/qemu-19716-qtest.sock -accel qtest -nodefaults -display none -accel qtest -drive if=virtio,id=drive0,file=/tmp/qemu-test/test.img,format=qcow2,cache=writeback,aio=threads,node-name=top,backing.node-name=base -drive if=ide,id=drive1,media=cdrom
+WARNING:qemu.machine:qemu received signal 6: /tmp/qemu-test/build/tests/qemu-iotests/../../x86_64-softmmu/qemu-system-x86_64 -display none -vga none -chardev socket,id=mon,path=/tmp/tmp.6XQrnYb2wb/qemu-19716-monitor.sock -mon chardev=mon,mode=control -qtest unix:path=/tmp/tmp.6XQrnYb2wb/qemu-19716-qtest.sock -accel qtest -nodefaults -display none -accel qtest -drive if=virtio,id=drive0,file=/tmp/qemu-test/test.img,format=qcow2,cache=writeback,aio=threads,node-name=top,backing.node-name=base -drive if=ide,id=drive1,media=cdrom
+WARNING:qemu.machine:qemu received signal 6: /tmp/qemu-test/build/tests/qemu-iotests/../../x86_64-softmmu/qemu-system-x86_64 -display none -vga none -chardev socket,id=mon,path=/tmp/tmp.6XQrnYb2wb/qemu-19716-monitor.sock -mon chardev=mon,mode=control -qtest unix:path=/tmp/tmp.6XQrnYb2wb/qemu-19716-qtest.sock -accel qtest -nodefaults -display none -accel qtest -drive if=virtio,id=drive0,file=/tmp/qemu-test/test.img,format=qcow2,cache=writeback,aio=threads,node-name=top,backing.node-name=base -drive if=ide,id=drive1,media=cdrom
+WARNING:qemu.machine:qemu received signal 6: /tmp/qemu-test/build/tests/qemu-iotests/../../x86_64-softmmu/qemu-system-x86_64 -display none -vga none -chardev socket,id=mon,path=/tmp/tmp.6XQrnYb2wb/qemu-19716-monitor.sock -mon chardev=mon,mode=control -qtest unix:path=/tmp/tmp.6XQrnYb2wb/qemu-19716-qtest.sock -accel qtest -nodefaults -display none -accel qtest -drive if=virtio,id=drive0,file=/tmp/qemu-test/test.img,format=qcow2,cache=writeback,aio=threads,node-name=top,backing.node-name=base -drive if=ide,id=drive1,media=cdrom
+WARNING:qemu.machine:qemu received signal 6: /tmp/qemu-test/build/tests/qemu-iotests/../../x86_64-softmmu/qemu-system-x86_64 -display none -vga none -chardev socket,id=mon,path=/tmp/tmp.6XQrnYb2wb/qemu-19716-monitor.sock -mon chardev=mon,mode=control -qtest unix:path=/tmp/tmp.6XQrnYb2wb/qemu-19716-qtest.sock -accel qtest -nodefaults -display none -accel qtest -drive if=virtio,id=drive0,file=/tmp/qemu-test/test.img,format=qcow2,cache=writeback,aio=threads,node-name=top,backing.node-name=base -drive if=ide,id=drive1,media=cdrom
+WARNING:qemu.machine:qemu received signal 6: /tmp/qemu-test/build/tests/qemu-iotests/../../x86_64-softmmu/qemu-system-x86_64 -display none -vga none -chardev socket,id=mon,path=/tmp/tmp.6XQrnYb2wb/qemu-19716-monitor.sock -mon chardev=mon,mode=control -qtest unix:path=/tmp/tmp.6XQrnYb2wb/qemu-19716-qtest.sock -accel qtest -nodefaults -display none -accel qtest -drive if=virtio,id=drive0,file=/tmp/qemu-test/test.img,format=qcow2,cache=writeback,aio=threads,node-name=top,backing.node-name=base -drive if=ide,id=drive1,media=cdrom
+WARNING:qemu.machine:qemu received signal 6: /tmp/qemu-test/build/tests/qemu-iotests/../../x86_64-softmmu/qemu-system-x86_64 -display none -vga none -chardev socket,id=mon,path=/tmp/tmp.6XQrnYb2wb/qemu-19716-monitor.sock -mon chardev=mon,mode=control -qtest unix:path=/tmp/tmp.6XQrnYb2wb/qemu-19716-qtest.sock -accel qtest -nodefaults -display none -accel qtest -drive if=virtio,id=drive0,file=/tmp/qemu-test/test.img,format=qcow2,cache=writeback,aio=threads,node-name=top,backing.node-name=base -drive if=ide,id=drive1,media=cdrom
+WARNING:qemu.machine:qemu received signal 6: /tmp/qemu-test/build/tests/qemu-iotests/../../x86_64-softmmu/qemu-system-x86_64 -display none -vga none -chardev socket,id=mon,path=/tmp/tmp.6XQrnYb2wb/qemu-19716-monitor.sock -mon chardev=mon,mode=control -qtest unix:path=/tmp/tmp.6XQrnYb2wb/qemu-19716-qtest.sock -accel qtest -nodefaults -display none -accel qtest -drive if=virtio,id=drive0,file=/tmp/qemu-test/test.img,format=qcow2,cache=writeback,aio=threads,node-name=top,backing.node-name=base -drive if=ide,id=drive1,media=cdrom
+WARNING:qemu.machine:qemu received signal 6: /tmp/qemu-test/build/tests/qemu-iotests/../../x86_64-softmmu/qemu-system-x86_64 -display none -vga none -chardev socket,id=mon,path=/tmp/tmp.6XQrnYb2wb/qemu-19716-monitor.sock -mon chardev=mon,mode=control -qtest unix:path=/tmp/tmp.6XQrnYb2wb/qemu-19716-qtest.sock -accel qtest -nodefaults -display none -accel qtest -drive if=virtio,id=drive0,file=/tmp/qemu-test/test.img,format=qcow2,cache=writeback,aio=threads,node-name=top,backing.node-name=base -drive if=ide,id=drive1,media=cdrom
+WARNING:qemu.machine:qemu received signal 6: /tmp/qemu-test/build/tests/qemu-iotests/../../x86_64-softmmu/qemu-system-x86_64 -display none -vga none -chardev socket,id=mon,path=/tmp/tmp.6XQrnYb2wb/qemu-19716-monitor.sock -mon chardev=mon,mode=control -qtest unix:path=/tmp/tmp.6XQrnYb2wb/qemu-19716-qtest.sock -accel qtest -nodefaults -display none -accel qtest -drive if=virtio,id=drive0,file=/tmp/qemu-test/test.img,format=qcow2,cache=writeback,aio=threads,node-name=top,backing.node-name=base -drive if=ide,id=drive1,media=cdrom
+WARNING:qemu.machine:qemu received signal 6: /tmp/qemu-test/build/tests/qemu-iotests/../../x86_64-softmmu/qemu-system-x86_64 -display none -vga none -chardev socket,id=mon,path=/tmp/tmp.6XQrnYb2wb/qemu-19716-monitor.sock -mon chardev=mon,mode=control -qtest unix:path=/tmp/tmp.6XQrnYb2wb/qemu-19716-qtest.sock -accel qtest -nodefaults -display none -accel qtest -drive if=virtio,id=drive0,file=/tmp/qemu-test/test.img,format=qcow2,cache=writeback,aio=threads,node-name=top,backing.node-name=base -drive if=ide,id=drive1,media=cdrom
+WARNING:qemu.machine:qemu received signal 6: /tmp/qemu-test/build/tests/qemu-iotests/../../x86_64-softmmu/qemu-system-x86_64 -display none -vga none -chardev socket,id=mon,path=/tmp/tmp.6XQrnYb2wb/qemu-19716-monitor.sock -mon chardev=mon,mode=control -qtest unix:path=/tmp/tmp.6XQrnYb2wb/qemu-19716-qtest.sock -accel qtest -nodefaults -display none -accel qtest -drive if=virtio,id=drive0,file=/tmp/qemu-test/test.img,format=qcow2,cache=writeback,aio=threads,node-name=top,backing.node-name=base -drive if=ide,id=drive1,media=cdrom
+WARNING:qemu.machine:qemu received signal 6: /tmp/qemu-test/build/tests/qemu-iotests/../../x86_64-softmmu/qemu-system-x86_64 -display none -vga none -chardev socket,id=mon,path=/tmp/tmp.6XQrnYb2wb/qemu-19716-monitor.sock -mon chardev=mon,mode=control -qtest unix:path=/tmp/tmp.6XQrnYb2wb/qemu-19716-qtest.sock -accel qtest -nodefaults -display none -accel qtest -drive if=virtio,id=drive0,file=/tmp/qemu-test/test.img,format=qcow2,cache=writeback,aio=threads,node-name=top,backing.node-name=base -drive if=ide,id=drive1,media=cdrom
+WARNING:qemu.machine:qemu received signal 6: /tmp/qemu-test/build/tests/qemu-iotests/../../x86_64-softmmu/qemu-system-x86_64 -display none -vga none -chardev socket,id=mon,path=/tmp/tmp.6XQrnYb2wb/qemu-19716-monitor.sock -mon chardev=mon,mode=control -qtest unix:path=/tmp/tmp.6XQrnYb2wb/qemu-19716-qtest.sock -accel qtest -nodefaults -display none -accel qtest -drive if=virtio,id=drive0,file=/tmp/qemu-test/test.img,format=qcow2,cache=writeback,aio=threads,node-name=top,backing.node-name=base -drive if=ide,id=drive1,media=cdrom
+WARNING:qemu.machine:qemu received signal 6: /tmp/qemu-test/build/tests/qemu-iotests/../../x86_64-softmmu/qemu-system-x86_64 -display none -vga none -chardev socket,id=mon,path=/tmp/tmp.6XQrnYb2wb/qemu-19716-monitor.sock -mon chardev=mon,mode=control -qtest unix:path=/tmp/tmp.6XQrnYb2wb/qemu-19716-qtest.sock -accel qtest -nodefaults -display none -accel qtest -drive if=virtio,id=drive0,file=/tmp/qemu-test/test.img,format=qcow2,cache=writeback,aio=threads,node-name=top,backing.node-name=base -drive if=ide,id=drive1,media=cdrom
+WARNING:qemu.machine:qemu received signal 6: /tmp/qemu-test/build/tests/qemu-iotests/../../x86_64-softmmu/qemu-system-x86_64 -display none -vga none -chardev socket,id=mon,path=/tmp/tmp.6XQrnYb2wb/qemu-19716-monitor.sock -mon chardev=mon,mode=control -qtest unix:path=/tmp/tmp.6XQrnYb2wb/qemu-19716-qtest.sock -accel qtest -nodefaults -display none -accel qtest -drive if=virtio,id=drive0,file=/tmp/qemu-test/test.img,format=qcow2,cache=writeback,aio=threads,node-name=top,backing.node-name=base -drive if=ide,id=drive1,media=cdrom
+WARNING:qemu.machine:qemu received signal 6: /tmp/qemu-test/build/tests/qemu-iotests/../../x86_64-softmmu/qemu-system-x86_64 -display none -vga none -chardev socket,id=mon,path=/tmp/tmp.6XQrnYb2wb/qemu-19716-monitor.sock -mon chardev=mon,mode=control -qtest unix:path=/tmp/tmp.6XQrnYb2wb/qemu-19716-qtest.sock -accel qtest -nodefaults -display none -accel qtest -drive if=virtio,id=drive0,file=/tmp/qemu-test/test.img,format=qcow2,cache=writeback,aio=threads,node-name=top,backing.node-name=base -drive if=ide,id=drive1,media=cdrom
+WARNING:qemu.machine:qemu received signal 6: /tmp/qemu-test/build/tests/qemu-iotests/../../x86_64-softmmu/qemu-system-x86_64 -display none -vga none -chardev socket,id=mon,path=/tmp/tmp.6XQrnYb2wb/qemu-19716-monitor.sock -mon chardev=mon,mode=control -qtest unix:path=/tmp/tmp.6XQrnYb2wb/qemu-19716-qtest.sock -accel qtest -nodefaults -display none -accel qtest -drive if=virtio,id=drive0,file=/tmp/qemu-test/test.img,format=qcow2,cache=writeback,aio=threads,node-name=top,backing.node-name=base -drive if=ide,id=drive1,media=cdrom
+WARNING:qemu.machine:qemu received signal 6: /tmp/qemu-test/build/tests/qemu-iotests/../../x86_64-softmmu/qemu-system-x86_64 -display none -vga none -chardev socket,id=mon,path=/tmp/tmp.6XQrnYb2wb/qemu-19716-monitor.sock -mon chardev=mon,mode=control -qtest unix:path=/tmp/tmp.6XQrnYb2wb/qemu-19716-qtest.sock -accel qtest -nodefaults -display none -accel qtest -drive if=virtio,id=drive0,file=/tmp/qemu-test/test.img,format=qcow2,cache=writeback,aio=threads,node-name=top,backing.node-name=base -drive if=ide,id=drive1,media=cdrom
+WARNING:qemu.machine:qemu received signal 6: /tmp/qemu-test/build/tests/qemu-iotests/../../x86_64-softmmu/qemu-system-x86_64 -display none -vga none -chardev socket,id=mon,path=/tmp/tmp.6XQrnYb2wb/qemu-19716-monitor.sock -mon chardev=mon,mode=control -qtest unix:path=/tmp/tmp.6XQrnYb2wb/qemu-19716-qtest.sock -accel qtest -nodefaults -display none -accel qtest -drive if=virtio,id=drive0,file=/tmp/qemu-test/test.img,format=qcow2,cache=writeback,aio=threads,node-name=top,backing.node-name=base -drive if=ide,id=drive1,media=cdrom
+WARNING:qemu.machine:qemu received signal 6: /tmp/qemu-test/build/tests/qemu-iotests/../../x86_64-softmmu/qemu-system-x86_64 -display none -vga none -chardev socket,id=mon,path=/tmp/tmp.6XQrnYb2wb/qemu-19716-monitor.sock -mon chardev=mon,mode=control -qtest unix:path=/tmp/tmp.6XQrnYb2wb/qemu-19716-qtest.sock -accel qtest -nodefaults -display none -accel qtest -drive if=virtio,id=drive0,file=/tmp/qemu-test/test.img,format=qcow2,cache=writeback,aio=threads,node-name=top,backing.node-name=base -drive if=ide,id=drive1,media=cdrom
+WARNING:qemu.machine:qemu received signal 6: /tmp/qemu-test/build/tests/qemu-iotests/../../x86_64-softmmu/qemu-system-x86_64 -display none -vga none -chardev socket,id=mon,path=/tmp/tmp.6XQrnYb2wb/qemu-19716-monitor.sock -mon chardev=mon,mode=control -qtest unix:path=/tmp/tmp.6XQrnYb2wb/qemu-19716-qtest.sock -accel qtest -nodefaults -display none -accel qtest -drive if=virtio,id=drive0,file=/tmp/qemu-test/test.img,format=qcow2,cache=writeback,aio=threads,node-name=top,backing.node-name=base -drive if=ide,id=drive1,media=cdrom
+WARNING:qemu.machine:qemu received signal 6: /tmp/qemu-test/build/tests/qemu-iotests/../../x86_64-softmmu/qemu-system-x86_64 -display none -vga none -chardev socket,id=mon,path=/tmp/tmp.6XQrnYb2wb/qemu-19716-monitor.sock -mon chardev=mon,mode=control -qtest unix:path=/tmp/tmp.6XQrnYb2wb/qemu-19716-qtest.sock -accel qtest -nodefaults -display none -accel qtest -drive if=virtio,id=drive0,file=/tmp/qemu-test/test.img,format=qcow2,cache=writeback,aio=threads,node-name=top,backing.node-name=base -drive if=ide,id=drive1,media=cdrom
+WARNING:qemu.machine:qemu received signal 6: /tmp/qemu-test/build/tests/qemu-iotests/../../x86_64-softmmu/qemu-system-x86_64 -display none -vga none -chardev socket,id=mon,path=/tmp/tmp.6XQrnYb2wb/qemu-19716-monitor.sock -mon chardev=mon,mode=control -qtest unix:path=/tmp/tmp.6XQrnYb2wb/qemu-19716-qtest.sock -accel qtest -nodefaults -display none -accel qtest -drive if=virtio,id=drive0,file=/tmp/qemu-test/test.img,format=qcow2,cache=writeback,aio=threads,node-name=top,backing.node-name=base -drive if=ide,id=drive1,media=cdrom
+WARNING:qemu.machine:qemu received signal 6: /tmp/qemu-test/build/tests/qemu-iotests/../../x86_64-softmmu/qemu-system-x86_64 -display none -vga none -chardev socket,id=mon,path=/tmp/tmp.6XQrnYb2wb/qemu-19716-monitor.sock -mon chardev=mon,mode=control -qtest unix:path=/tmp/tmp.6XQrnYb2wb/qemu-19716-qtest.sock -accel qtest -nodefaults -display none -accel qtest -drive if=virtio,id=drive0,file=/tmp/qemu-test/test.img,format=qcow2,cache=writeback,aio=threads,node-name=top,backing.node-name=base -drive if=ide,id=drive1,media=cdrom
+WARNING:qemu.machine:qemu received signal 6: /tmp/qemu-test/build/tests/qemu-iotests/../../x86_64-softmmu/qemu-system-x86_64 -display none -vga none -chardev socket,id=mon,path=/tmp/tmp.6XQrnYb2wb/qemu-19716-monitor.sock -mon chardev=mon,mode=control -qtest unix:path=/tmp/tmp.6XQrnYb2wb/qemu-19716-qtest.sock -accel qtest -nodefaults -display none -accel qtest -drive if=virtio,id=drive0,file=/tmp/qemu-test/test.img,format=qcow2,cache=writeback,aio=threads,node-name=top,backing.node-name=base -drive if=ide,id=drive1,media=cdrom
+WARNING:qemu.machine:qemu received signal 6: /tmp/qemu-test/build/tests/qemu-iotests/../../x86_64-softmmu/qemu-system-x86_64 -display none -vga none -chardev socket,id=mon,path=/tmp/tmp.6XQrnYb2wb/qemu-19716-monitor.sock -mon chardev=mon,mode=control -qtest unix:path=/tmp/tmp.6XQrnYb2wb/qemu-19716-qtest.sock -accel qtest -nodefaults -display none -accel qtest -drive if=virtio,id=drive0,file=/tmp/qemu-test/test.img,format=qcow2,cache=writeback,aio=threads,node-name=top,backing.node-name=base -drive if=ide,id=drive1,media=cdrom
+WARNING:qemu.machine:qemu received signal 6: /tmp/qemu-test/build/tests/qemu-iotests/../../x86_64-softmmu/qemu-system-x86_64 -display none -vga none -chardev socket,id=mon,path=/tmp/tmp.6XQrnYb2wb/qemu-19716-monitor.sock -mon chardev=mon,mode=control -qtest unix:path=/tmp/tmp.6XQrnYb2wb/qemu-19716-qtest.sock -accel qtest -nodefaults -display none -accel qtest -drive if=virtio,id=drive0,file=/tmp/qemu-test/test.img,format=qcow2,cache=writeback,aio=threads,node-name=top,backing.node-name=base -drive if=ide,id=drive1,media=cdrom
+WARNING:qemu.machine:qemu received signal 6: /tmp/qemu-test/build/tests/qemu-iotests/../../x86_64-softmmu/qemu-system-x86_64 -display none -vga none -chardev socket,id=mon,path=/tmp/tmp.6XQrnYb2wb/qemu-19716-monitor.sock -mon chardev=mon,mode=control -qtest unix:path=/tmp/tmp.6XQrnYb2wb/qemu-19716-qtest.sock -accel qtest -nodefaults -display none -accel qtest -drive if=virtio,id=drive0,file=/tmp/qemu-test/test.img,format=qcow2,cache=writeback,aio=threads,node-name=top,backing.node-name=base -drive if=ide,id=drive1,media=cdrom
+WARNING:qemu.machine:qemu received signal 6: /tmp/qemu-test/build/tests/qemu-iotests/../../x86_64-softmmu/qemu-system-x86_64 -display none -vga none -chardev socket,id=mon,path=/tmp/tmp.6XQrnYb2wb/qemu-19716-monitor.sock -mon chardev=mon,mode=control -qtest unix:path=/tmp/tmp.6XQrnYb2wb/qemu-19716-qtest.sock -accel qtest -nodefaults -display none -accel qtest -drive if=virtio,id=drive0,file=/tmp/qemu-test/test.img,format=qcow2,cache=writeback,aio=threads,node-name=top,backing.node-name=base -drive if=ide,id=drive1,media=cdrom
+WARNING:qemu.machine:qemu received signal 6: /tmp/qemu-test/build/tests/qemu-iotests/../../x86_64-softmmu/qemu-system-x86_64 -display none -vga none -chardev socket,id=mon,path=/tmp/tmp.6XQrnYb2wb/qemu-19716-monitor.sock -mon chardev=mon,mode=control -qtest unix:path=/tmp/tmp.6XQrnYb2wb/qemu-19716-qtest.sock -accel qtest -nodefaults -display none -accel qtest
+WARNING:qemu.machine:qemu received signal 6: /tmp/qemu-test/build/tests/qemu-iotests/../../x86_64-softmmu/qemu-system-x86_64 -display none -vga none -chardev socket,id=mon,path=/tmp/tmp.6XQrnYb2wb/qemu-19716-monitor.sock -mon chardev=mon,mode=control -qtest unix:path=/tmp/tmp.6XQrnYb2wb/qemu-19716-qtest.sock -accel qtest -nodefaults -display none -accel qtest
+WARNING:qemu.machine:qemu received signal 6: /tmp/qemu-test/build/tests/qemu-iotests/../../x86_64-softmmu/qemu-system-x86_64 -display none -vga none -chardev socket,id=mon,path=/tmp/tmp.6XQrnYb2wb/qemu-19716-monitor.sock -mon chardev=mon,mode=control -qtest unix:path=/tmp/tmp.6XQrnYb2wb/qemu-19716-qtest.sock -accel qtest -nodefaults -display none -accel qtest
+WARNING:qemu.machine:qemu received signal 6: /tmp/qemu-test/build/tests/qemu-iotests/../../x86_64-softmmu/qemu-system-x86_64 -display none -vga none -chardev socket,id=mon,path=/tmp/tmp.6XQrnYb2wb/qemu-19716-monitor.sock -mon chardev=mon,mode=control -qtest unix:path=/tmp/tmp.6XQrnYb2wb/qemu-19716-qtest.sock -accel qtest -nodefaults -display none -accel qtest
+WARNING:qemu.machine:qemu received signal 6: /tmp/qemu-test/build/tests/qemu-iotests/../../x86_64-softmmu/qemu-system-x86_64 -display none -vga none -chardev socket,id=mon,path=/tmp/tmp.6XQrnYb2wb/qemu-19716-monitor.sock -mon chardev=mon,mode=control -qtest unix:path=/tmp/tmp.6XQrnYb2wb/qemu-19716-qtest.sock -accel qtest -nodefaults -display none -accel qtest
+WARNING:qemu.machine:qemu received signal 6: /tmp/qemu-test/build/tests/qemu-iotests/../../x86_64-softmmu/qemu-system-x86_64 -display none -vga none -chardev socket,id=mon,path=/tmp/tmp.6XQrnYb2wb/qemu-19716-monitor.sock -mon chardev=mon,mode=control -qtest unix:path=/tmp/tmp.6XQrnYb2wb/qemu-19716-qtest.sock -accel qtest -nodefaults -display none -accel qtest -drive if=virtio,id=drive0,file=/tmp/qemu-test/test.img,format=qcow2,cache=writeback,aio=threads
+WARNING:qemu.machine:qemu received signal 6: /tmp/qemu-test/build/tests/qemu-iotests/../../x86_64-softmmu/qemu-system-x86_64 -display none -vga none -chardev socket,id=mon,path=/tmp/tmp.6XQrnYb2wb/qemu-19716-monitor.sock -mon chardev=mon,mode=control -qtest unix:path=/tmp/tmp.6XQrnYb2wb/qemu-19716-qtest.sock -accel qtest -nodefaults -display none -accel qtest -drive if=virtio,id=drive0,file=/tmp/qemu-test/test.img,format=qcow2,cache=writeback,aio=threads
+WARNING:qemu.machine:qemu received signal 6: /tmp/qemu-test/build/tests/qemu-iotests/../../x86_64-softmmu/qemu-system-x86_64 -display none -vga none -chardev socket,id=mon,path=/tmp/tmp.6XQrnYb2wb/qemu-19716-monitor.sock -mon chardev=mon,mode=control -qtest unix:path=/tmp/tmp.6XQrnYb2wb/qemu-19716-qtest.sock -accel qtest -nodefaults -display none -accel qtest -drive if=virtio,id=drive0,file=/tmp/qemu-test/test.img,format=qcow2,cache=writeback,aio=threads
+EEEEEEEEEEEEEE.............EEEEEEEEEEEEEEEEEEEEEEEEEEEEEEEEEEEEEEEEEEEEEEEEEEEEEEEEEEEEEEEEEEEEEEEEEEEEE
+======================================================================
+ERROR: test_granularity (__main__.TestGranularity)
+----------------------------------------------------------------------
+Traceback (most recent call last):
+  File "041", line 883, in setUp
---
+socket.timeout: timed out
+
+======================================================================
+ERROR: test_cancel (__main__.TestMirrorNoBacking)
+----------------------------------------------------------------------
+Traceback (most recent call last):
+  File "041", line 317, in setUp
---
+socket.timeout: timed out
+
+======================================================================
+ERROR: test_complete (__main__.TestMirrorNoBacking)
+----------------------------------------------------------------------
+Traceback (most recent call last):
+  File "041", line 317, in setUp
---
+socket.timeout: timed out
+
+======================================================================
+ERROR: test_large_cluster (__main__.TestMirrorNoBacking)
+----------------------------------------------------------------------
+Traceback (most recent call last):
+  File "041", line 317, in setUp
---
+socket.timeout: timed out
+
+======================================================================
+ERROR: test_complete_full (__main__.TestMirrorResized)
+----------------------------------------------------------------------
+Traceback (most recent call last):
+  File "041", line 388, in setUp
---
+socket.timeout: timed out
+
+======================================================================
+ERROR: test_complete_top (__main__.TestMirrorResized)
+----------------------------------------------------------------------
+Traceback (most recent call last):
+  File "041", line 388, in setUp
---
+socket.timeout: timed out
+
+======================================================================
+ERROR: test_failing_permission_in_complete (__main__.TestOrphanedSource)
+----------------------------------------------------------------------
+Traceback (most recent call last):
+  File "041", line 1160, in setUp
---
+socket.timeout: timed out
+
+======================================================================
+ERROR: test_failing_permissions (__main__.TestOrphanedSource)
+----------------------------------------------------------------------
+Traceback (most recent call last):
+  File "041", line 1160, in setUp
---
+socket.timeout: timed out
+
+======================================================================
+ERROR: test_no_job_id (__main__.TestOrphanedSource)
+----------------------------------------------------------------------
+Traceback (most recent call last):
+  File "041", line 1160, in setUp
---
+socket.timeout: timed out
+
+======================================================================
+ERROR: test_success (__main__.TestOrphanedSource)
+----------------------------------------------------------------------
+Traceback (most recent call last):
+  File "041", line 1160, in setUp
---
+socket.timeout: timed out
+
+======================================================================
+ERROR: test_ignore_read (__main__.TestReadErrors)
+----------------------------------------------------------------------
+Traceback (most recent call last):
+  File "041", line 469, in setUp
---
+socket.timeout: timed out
+
+======================================================================
+ERROR: test_large_cluster (__main__.TestReadErrors)
+----------------------------------------------------------------------
+Traceback (most recent call last):
+  File "041", line 469, in setUp
---
+socket.timeout: timed out
+
+======================================================================
+ERROR: test_report_read (__main__.TestReadErrors)
+----------------------------------------------------------------------
+Traceback (most recent call last):
+  File "041", line 469, in setUp
---
+socket.timeout: timed out
+
+======================================================================
+ERROR: test_stop_read (__main__.TestReadErrors)
+----------------------------------------------------------------------
+Traceback (most recent call last):
+  File "041", line 469, in setUp
---
+socket.timeout: timed out
+
+======================================================================
+ERROR: test_replace_filter (__main__.TestReplaces)
+----------------------------------------------------------------------
+Traceback (most recent call last):
+  File "041", line 1238, in setUp
---
+socket.timeout: timed out
+
+======================================================================
+ERROR: test_set_speed (__main__.TestSetSpeed)
+----------------------------------------------------------------------
+Traceback (most recent call last):
+  File "041", line 720, in setUp
---
+socket.timeout: timed out
+
+======================================================================
+ERROR: test_set_speed_invalid (__main__.TestSetSpeed)
+----------------------------------------------------------------------
+Traceback (most recent call last):
+  File "041", line 720, in setUp
---
+socket.timeout: timed out
+
+======================================================================
+ERROR: test_cancel (__main__.TestSingleBlockdev)
+----------------------------------------------------------------------
+Traceback (most recent call last):
+  File "041", line 229, in setUp
---
+socket.timeout: timed out
+
+======================================================================
+ERROR: test_cancel_after_ready (__main__.TestSingleBlockdev)
+----------------------------------------------------------------------
+Traceback (most recent call last):
+  File "041", line 229, in setUp
---
+socket.timeout: timed out
+
+======================================================================
+ERROR: test_complete (__main__.TestSingleBlockdev)
+----------------------------------------------------------------------
+Traceback (most recent call last):
+  File "041", line 229, in setUp
---
+socket.timeout: timed out
+
+======================================================================
+ERROR: test_device_not_found (__main__.TestSingleBlockdev)
+----------------------------------------------------------------------
+Traceback (most recent call last):
+  File "041", line 229, in setUp
---
+socket.timeout: timed out
+
+======================================================================
+ERROR: test_implicit_node (__main__.TestSingleBlockdev)
+----------------------------------------------------------------------
+Traceback (most recent call last):
+  File "041", line 229, in setUp
---
+socket.timeout: timed out
+
+======================================================================
+ERROR: test_large_target (__main__.TestSingleBlockdev)
+----------------------------------------------------------------------
+Traceback (most recent call last):
+  File "041", line 229, in setUp
---
+socket.timeout: timed out
+
+======================================================================
+ERROR: test_medium_not_found (__main__.TestSingleBlockdev)
+----------------------------------------------------------------------
+Traceback (most recent call last):
+  File "041", line 229, in setUp
---
+socket.timeout: timed out
+
+======================================================================
+ERROR: test_mirror_to_self (__main__.TestSingleBlockdev)
+----------------------------------------------------------------------
+Traceback (most recent call last):
+  File "041", line 229, in setUp
---
+socket.timeout: timed out
+
+======================================================================
+ERROR: test_pause (__main__.TestSingleBlockdev)
+----------------------------------------------------------------------
+Traceback (most recent call last):
+  File "041", line 229, in setUp
---
+socket.timeout: timed out
+
+======================================================================
+ERROR: test_small_buffer (__main__.TestSingleBlockdev)
+----------------------------------------------------------------------
+Traceback (most recent call last):
+  File "041", line 229, in setUp
---
+socket.timeout: timed out
+
+======================================================================
+ERROR: test_small_target (__main__.TestSingleBlockdev)
+----------------------------------------------------------------------
+Traceback (most recent call last):
+  File "041", line 229, in setUp
---
+socket.timeout: timed out
+
+======================================================================
+ERROR: test_source_resize (__main__.TestSingleBlockdev)
+----------------------------------------------------------------------
+Traceback (most recent call last):
+  File "041", line 229, in setUp
---
+socket.timeout: timed out
+
+======================================================================
+ERROR: test_target_resize (__main__.TestSingleBlockdev)
+----------------------------------------------------------------------
+Traceback (most recent call last):
+  File "041", line 229, in setUp
---
+socket.timeout: timed out
+
+======================================================================
+ERROR: test_cancel (__main__.TestSingleBlockdevUnalignedLength)
+----------------------------------------------------------------------
+Traceback (most recent call last):
+  File "041", line 229, in setUp
---
+socket.timeout: timed out
+
+======================================================================
+ERROR: test_cancel_after_ready (__main__.TestSingleBlockdevUnalignedLength)
+----------------------------------------------------------------------
+Traceback (most recent call last):
+  File "041", line 229, in setUp
---
+socket.timeout: timed out
+
+======================================================================
+ERROR: test_complete (__main__.TestSingleBlockdevUnalignedLength)
+----------------------------------------------------------------------
+Traceback (most recent call last):
+  File "041", line 229, in setUp
---
+socket.timeout: timed out
+
+======================================================================
+ERROR: test_device_not_found (__main__.TestSingleBlockdevUnalignedLength)
+----------------------------------------------------------------------
+Traceback (most recent call last):
+  File "041", line 229, in setUp
---
+socket.timeout: timed out
+
+======================================================================
+ERROR: test_implicit_node (__main__.TestSingleBlockdevUnalignedLength)
+----------------------------------------------------------------------
+Traceback (most recent call last):
+  File "041", line 229, in setUp
---
+socket.timeout: timed out
+
+======================================================================
+ERROR: test_large_target (__main__.TestSingleBlockdevUnalignedLength)
+----------------------------------------------------------------------
+Traceback (most recent call last):
+  File "041", line 229, in setUp
---
+socket.timeout: timed out
+
+======================================================================
+ERROR: test_medium_not_found (__main__.TestSingleBlockdevUnalignedLength)
+----------------------------------------------------------------------
+Traceback (most recent call last):
+  File "041", line 229, in setUp
---
+socket.timeout: timed out
+
+======================================================================
+ERROR: test_mirror_to_self (__main__.TestSingleBlockdevUnalignedLength)
+----------------------------------------------------------------------
+Traceback (most recent call last):
+  File "041", line 229, in setUp
---
+socket.timeout: timed out
+
+======================================================================
+ERROR: test_pause (__main__.TestSingleBlockdevUnalignedLength)
+----------------------------------------------------------------------
+Traceback (most recent call last):
+  File "041", line 229, in setUp
---
+socket.timeout: timed out
+
+======================================================================
+ERROR: test_small_buffer (__main__.TestSingleBlockdevUnalignedLength)
+----------------------------------------------------------------------
+Traceback (most recent call last):
+  File "041", line 229, in setUp
---
+socket.timeout: timed out
+
+======================================================================
+ERROR: test_small_target (__main__.TestSingleBlockdevUnalignedLength)
+----------------------------------------------------------------------
+Traceback (most recent call last):
+  File "041", line 229, in setUp
---
+socket.timeout: timed out
+
+======================================================================
+ERROR: test_source_resize (__main__.TestSingleBlockdevUnalignedLength)
+----------------------------------------------------------------------
+Traceback (most recent call last):
+  File "041", line 229, in setUp
---
+socket.timeout: timed out
+
+======================================================================
+ERROR: test_target_resize (__main__.TestSingleBlockdevUnalignedLength)
+----------------------------------------------------------------------
+Traceback (most recent call last):
+  File "041", line 229, in setUp
---
+socket.timeout: timed out
+
+======================================================================
+ERROR: test_cancel (__main__.TestSingleBlockdevZeroLength)
+----------------------------------------------------------------------
+Traceback (most recent call last):
+  File "041", line 229, in setUp
---
+socket.timeout: timed out
+
+======================================================================
+ERROR: test_cancel_after_ready (__main__.TestSingleBlockdevZeroLength)
+----------------------------------------------------------------------
+Traceback (most recent call last):
+  File "041", line 229, in setUp
---
+socket.timeout: timed out
+
+======================================================================
+ERROR: test_complete (__main__.TestSingleBlockdevZeroLength)
+----------------------------------------------------------------------
+Traceback (most recent call last):
+  File "041", line 229, in setUp
---
+socket.timeout: timed out
+
+======================================================================
+ERROR: test_device_not_found (__main__.TestSingleBlockdevZeroLength)
+----------------------------------------------------------------------
+Traceback (most recent call last):
+  File "041", line 229, in setUp
---
+socket.timeout: timed out
+
+======================================================================
+ERROR: test_implicit_node (__main__.TestSingleBlockdevZeroLength)
+----------------------------------------------------------------------
+Traceback (most recent call last):
+  File "041", line 229, in setUp
---
+socket.timeout: timed out
+
+======================================================================
+ERROR: test_medium_not_found (__main__.TestSingleBlockdevZeroLength)
+----------------------------------------------------------------------
+Traceback (most recent call last):
+  File "041", line 229, in setUp
---
+socket.timeout: timed out
+
+======================================================================
+ERROR: test_mirror_to_self (__main__.TestSingleBlockdevZeroLength)
+----------------------------------------------------------------------
+Traceback (most recent call last):
+  File "041", line 229, in setUp
---
+socket.timeout: timed out
+
+======================================================================
+ERROR: test_pause (__main__.TestSingleBlockdevZeroLength)
+----------------------------------------------------------------------
+Traceback (most recent call last):
+  File "041", line 229, in setUp
---
+socket.timeout: timed out
+
+======================================================================
+ERROR: test_small_buffer (__main__.TestSingleBlockdevZeroLength)
+----------------------------------------------------------------------
+Traceback (most recent call last):
+  File "041", line 229, in setUp
---
+socket.timeout: timed out
+
+======================================================================
+ERROR: test_source_resize (__main__.TestSingleBlockdevZeroLength)
+----------------------------------------------------------------------
+Traceback (most recent call last):
+  File "041", line 229, in setUp
---
+socket.timeout: timed out
+
+======================================================================
+ERROR: test_target_resize (__main__.TestSingleBlockdevZeroLength)
+----------------------------------------------------------------------
+Traceback (most recent call last):
+  File "041", line 229, in setUp
---
+socket.timeout: timed out
+
+======================================================================
+ERROR: test_cancel (__main__.TestSingleDrive)
+----------------------------------------------------------------------
+Traceback (most recent call last):
+  File "041", line 51, in setUp
---
+socket.timeout: timed out
+
+======================================================================
+ERROR: test_cancel_after_ready (__main__.TestSingleDrive)
+----------------------------------------------------------------------
+Traceback (most recent call last):
+  File "041", line 51, in setUp
---
+socket.timeout: timed out
+
+======================================================================
+ERROR: test_complete (__main__.TestSingleDrive)
+----------------------------------------------------------------------
+Traceback (most recent call last):
+  File "041", line 51, in setUp
---
+socket.timeout: timed out
+
+======================================================================
+ERROR: test_device_not_found (__main__.TestSingleDrive)
+----------------------------------------------------------------------
+Traceback (most recent call last):
+  File "041", line 51, in setUp
---
+socket.timeout: timed out
+
+======================================================================
+ERROR: test_image_not_found (__main__.TestSingleDrive)
+----------------------------------------------------------------------
+Traceback (most recent call last):
+  File "041", line 51, in setUp
---
+socket.timeout: timed out
+
+======================================================================
+ERROR: test_implicit_node (__main__.TestSingleDrive)
+----------------------------------------------------------------------
+Traceback (most recent call last):
+  File "041", line 51, in setUp
---
+socket.timeout: timed out
+
+======================================================================
+ERROR: test_large_cluster (__main__.TestSingleDrive)
+----------------------------------------------------------------------
+Traceback (most recent call last):
+  File "041", line 51, in setUp
---
+socket.timeout: timed out
+
+======================================================================
+ERROR: test_medium_not_found (__main__.TestSingleDrive)
+----------------------------------------------------------------------
+Traceback (most recent call last):
+  File "041", line 51, in setUp
---
+socket.timeout: timed out
+
+======================================================================
+ERROR: test_pause (__main__.TestSingleDrive)
+----------------------------------------------------------------------
+Traceback (most recent call last):
+  File "041", line 51, in setUp
---
+socket.timeout: timed out
+
+======================================================================
+ERROR: test_small_buffer (__main__.TestSingleDrive)
+----------------------------------------------------------------------
+Traceback (most recent call last):
+  File "041", line 51, in setUp
---
+socket.timeout: timed out
+
+======================================================================
+ERROR: test_small_buffer2 (__main__.TestSingleDrive)
+----------------------------------------------------------------------
+Traceback (most recent call last):
+  File "041", line 51, in setUp
---
+socket.timeout: timed out
+
+======================================================================
+ERROR: test_cancel (__main__.TestSingleDriveUnalignedLength)
+----------------------------------------------------------------------
+Traceback (most recent call last):
+  File "041", line 51, in setUp
---
+socket.timeout: timed out
+
+======================================================================
+ERROR: test_cancel_after_ready (__main__.TestSingleDriveUnalignedLength)
+----------------------------------------------------------------------
+Traceback (most recent call last):
+  File "041", line 51, in setUp
---
+socket.timeout: timed out
+
+======================================================================
+ERROR: test_complete (__main__.TestSingleDriveUnalignedLength)
+----------------------------------------------------------------------
+Traceback (most recent call last):
+  File "041", line 51, in setUp
---
+socket.timeout: timed out
+
+======================================================================
+ERROR: test_device_not_found (__main__.TestSingleDriveUnalignedLength)
+----------------------------------------------------------------------
+Traceback (most recent call last):
+  File "041", line 51, in setUp
---
+socket.timeout: timed out
+
+======================================================================
+ERROR: test_image_not_found (__main__.TestSingleDriveUnalignedLength)
+----------------------------------------------------------------------
+Traceback (most recent call last):
+  File "041", line 51, in setUp
---
+socket.timeout: timed out
+
+======================================================================
+ERROR: test_implicit_node (__main__.TestSingleDriveUnalignedLength)
+----------------------------------------------------------------------
+Traceback (most recent call last):
+  File "041", line 51, in setUp
---
+socket.timeout: timed out
+
+======================================================================
+ERROR: test_medium_not_found (__main__.TestSingleDriveUnalignedLength)
+----------------------------------------------------------------------
+Traceback (most recent call last):
+  File "041", line 51, in setUp
---
+socket.timeout: timed out
+
+======================================================================
+ERROR: test_pause (__main__.TestSingleDriveUnalignedLength)
+----------------------------------------------------------------------
+Traceback (most recent call last):
+  File "041", line 51, in setUp
---
+socket.timeout: timed out
+
+======================================================================
+ERROR: test_small_buffer (__main__.TestSingleDriveUnalignedLength)
+----------------------------------------------------------------------
+Traceback (most recent call last):
+  File "041", line 51, in setUp
---
+socket.timeout: timed out
+
+======================================================================
+ERROR: test_cancel (__main__.TestSingleDriveZeroLength)
+----------------------------------------------------------------------
+Traceback (most recent call last):
+  File "041", line 51, in setUp
---
+socket.timeout: timed out
+
+======================================================================
+ERROR: test_cancel_after_ready (__main__.TestSingleDriveZeroLength)
+----------------------------------------------------------------------
+Traceback (most recent call last):
+  File "041", line 51, in setUp
---
+socket.timeout: timed out
+
+======================================================================
+ERROR: test_complete (__main__.TestSingleDriveZeroLength)
+----------------------------------------------------------------------
+Traceback (most recent call last):
+  File "041", line 51, in setUp
---
+socket.timeout: timed out
+
+======================================================================
+ERROR: test_device_not_found (__main__.TestSingleDriveZeroLength)
+----------------------------------------------------------------------
+Traceback (most recent call last):
+  File "041", line 51, in setUp
---
+socket.timeout: timed out
+
+======================================================================
+ERROR: test_image_not_found (__main__.TestSingleDriveZeroLength)
+----------------------------------------------------------------------
+Traceback (most recent call last):
+  File "041", line 51, in setUp
---
+socket.timeout: timed out
+
+======================================================================
+ERROR: test_implicit_node (__main__.TestSingleDriveZeroLength)
+----------------------------------------------------------------------
+Traceback (most recent call last):
+  File "041", line 51, in setUp
---
+socket.timeout: timed out
+
+======================================================================
+ERROR: test_medium_not_found (__main__.TestSingleDriveZeroLength)
+----------------------------------------------------------------------
+Traceback (most recent call last):
+  File "041", line 51, in setUp
---
+socket.timeout: timed out
+
+======================================================================
+ERROR: test_pause (__main__.TestSingleDriveZeroLength)
+----------------------------------------------------------------------
+Traceback (most recent call last):
+  File "041", line 51, in setUp
---
+socket.timeout: timed out
+
+======================================================================
+ERROR: test_small_buffer (__main__.TestSingleDriveZeroLength)
+----------------------------------------------------------------------
+Traceback (most recent call last):
+  File "041", line 51, in setUp
---
+socket.timeout: timed out
+
+======================================================================
+ERROR: test_absolute_paths_full (__main__.TestUnbackedSource)
+----------------------------------------------------------------------
+Traceback (most recent call last):
+  File "041", line 786, in setUp
---
+socket.timeout: timed out
+
+======================================================================
+ERROR: test_absolute_paths_none (__main__.TestUnbackedSource)
+----------------------------------------------------------------------
+Traceback (most recent call last):
+  File "041", line 786, in setUp
---
+socket.timeout: timed out
+
+======================================================================
+ERROR: test_absolute_paths_top (__main__.TestUnbackedSource)
+----------------------------------------------------------------------
+Traceback (most recent call last):
+  File "041", line 786, in setUp
---
+socket.timeout: timed out
+
+======================================================================
+ERROR: test_blockdev_full (__main__.TestUnbackedSource)
+----------------------------------------------------------------------
+Traceback (most recent call last):
+  File "041", line 786, in setUp
---
+socket.timeout: timed out
+
+======================================================================
+ERROR: test_existing_full (__main__.TestUnbackedSource)
+----------------------------------------------------------------------
+Traceback (most recent call last):
+  File "041", line 786, in setUp
---
+socket.timeout: timed out
+
+======================================================================
+ERROR: test_ignore_write (__main__.TestWriteErrors)
+----------------------------------------------------------------------
+Traceback (most recent call last):
+  File "041", line 627, in setUp
---
+socket.timeout: timed out
+
+======================================================================
+ERROR: test_report_write (__main__.TestWriteErrors)
+----------------------------------------------------------------------
+Traceback (most recent call last):
+  File "041", line 627, in setUp
---
+socket.timeout: timed out
+
+======================================================================
+ERROR: test_stop_write (__main__.TestWriteErrors)
+----------------------------------------------------------------------
+Traceback (most recent call last):
+  File "041", line 627, in setUp
---
 Ran 104 tests
 
-OK
+FAILED (errors=91, skipped=13)
  TEST    iotest-qcow2: 042
  TEST    iotest-qcow2: 043
  TEST    iotest-qcow2: 046
---
 === Using -drive if=none and -global ===
 
 Testing: -drive if=none,file=TEST_DIR/t.qcow2 -global isa-fdc.driveA=none0
-QEMU_PROG: warning: warning: property isa-fdc.driveA is deprecated
-Use -device floppy,unit=0,drive=... instead.
-
-          dev: isa-fdc, id ""
---
+fi; VALGRIND_QEMU="${VALGRIND_QEMU_VM}" _qemu_proc_exec "${VALGRIND_LOGFILE}" "$QEMU_PROG" $QEMU_OPTIONS "$@" )
 
 Testing: -drive if=none,file=TEST_DIR/t.qcow2 -global isa-fdc.driveB=none0
-QEMU_PROG: warning: warning: property isa-fdc.driveB is deprecated
-Use -device floppy,unit=1,drive=... instead.
-
-          dev: isa-fdc, id ""
---
+fi; VALGRIND_QEMU="${VALGRIND_QEMU_VM}" _qemu_proc_exec "${VALGRIND_LOGFILE}" "$QEMU_PROG" $QEMU_OPTIONS "$@" )
 
 Testing: -drive if=none,file=TEST_DIR/t.qcow2 -drive if=none,file=TEST_DIR/t.qcow2.2 -global isa-fdc.driveA=none0 -global isa-fdc.driveB=none1
-QEMU_PROG: warning: warning: property isa-fdc.driveA is deprecated
-Use -device floppy,unit=0,drive=... instead.
-QEMU_PROG: warning: warning: property isa-fdc.driveB is deprecated
-Use -device floppy,unit=1,drive=... instead.
-
-          dev: isa-fdc, id ""
---
 === Mixing -fdX and -global ===
 
 Testing: -fda TEST_DIR/t.qcow2 -drive if=none,file=TEST_DIR/t.qcow2.2 -global isa-fdc.driveB=none0
-QEMU_PROG: warning: warning: property isa-fdc.driveB is deprecated
-Use -device floppy,unit=1,drive=... instead.
-
-          dev: isa-fdc, id ""
---
+fi; VALGRIND_QEMU="${VALGRIND_QEMU_VM}" _qemu_proc_exec "${VALGRIND_LOGFILE}" "$QEMU_PROG" $QEMU_OPTIONS "$@" )
 
 Testing: -fdb TEST_DIR/t.qcow2 -drive if=none,file=TEST_DIR/t.qcow2.2 -global isa-fdc.driveA=none0
-QEMU_PROG: warning: warning: property isa-fdc.driveA is deprecated
-Use -device floppy,unit=0,drive=... instead.
-
-          dev: isa-fdc, id ""
---
+fi; VALGRIND_QEMU="${VALGRIND_QEMU_VM}" _qemu_proc_exec "${VALGRIND_LOGFILE}" "$QEMU_PROG" $QEMU_OPTIONS "$@" )
 
 Testing: -fda TEST_DIR/t.qcow2 -drive if=none,file=TEST_DIR/t.qcow2.2 -global isa-fdc.driveA=none0
-QEMU_PROG: warning: warning: property isa-fdc.driveA is deprecated
-Use -device floppy,unit=0,drive=... instead.
-QEMU_PROG: Floppy unit 0 is in use
+QEMU_PROG: /tmp/qemu-test/src/memory.c:1489: memory_region_init_io: Assertion `ops->read || ops->read_with_attrs' failed.
---
+fi; VALGRIND_QEMU="${VALGRIND_QEMU_VM}" _qemu_proc_exec "${VALGRIND_LOGFILE}" "$QEMU_PROG" $QEMU_OPTIONS "$@" )
 
 Testing: -fdb TEST_DIR/t.qcow2 -drive if=none,file=TEST_DIR/t.qcow2.2 -global isa-fdc.driveB=none0
-QEMU_PROG: warning: warning: property isa-fdc.driveB is deprecated
-Use -device floppy,unit=1,drive=... instead.
-QEMU_PROG: Floppy unit 1 is in use
+QEMU_PROG: /tmp/qemu-test/src/memory.c:1489: memory_region_init_io: Assertion `ops->read || ops->read_with_attrs' failed.
---
 === Mixing -global and -device ===
 
 Testing: -drive if=none,file=TEST_DIR/t.qcow2 -drive if=none,file=TEST_DIR/t.qcow2.2 -global isa-fdc.driveA=none0 -device floppy,drive=none1
-QEMU_PROG: warning: warning: property isa-fdc.driveA is deprecated
-Use -device floppy,unit=0,drive=... instead.
-
-          dev: isa-fdc, id ""
---
+fi; VALGRIND_QEMU="${VALGRIND_QEMU_VM}" _qemu_proc_exec "${VALGRIND_LOGFILE}" "$QEMU_PROG" $QEMU_OPTIONS "$@" )
 
 Testing: -drive if=none,file=TEST_DIR/t.qcow2 -drive if=none,file=TEST_DIR/t.qcow2.2 -global isa-fdc.driveA=none0 -device floppy,drive=none1,unit=1
-QEMU_PROG: warning: warning: property isa-fdc.driveA is deprecated
-Use -device floppy,unit=0,drive=... instead.
-
-          dev: isa-fdc, id ""
---
+fi; VALGRIND_QEMU="${VALGRIND_QEMU_VM}" _qemu_proc_exec "${VALGRIND_LOGFILE}" "$QEMU_PROG" $QEMU_OPTIONS "$@" )
 
 Testing: -drive if=none,file=TEST_DIR/t.qcow2 -drive if=none,file=TEST_DIR/t.qcow2.2 -global isa-fdc.driveB=none0 -device floppy,drive=none1
-QEMU_PROG: warning: warning: property isa-fdc.driveB is deprecated
-Use -device floppy,unit=1,drive=... instead.
-
-          dev: isa-fdc, id ""
---
+fi; VALGRIND_QEMU="${VALGRIND_QEMU_VM}" _qemu_proc_exec "${VALGRIND_LOGFILE}" "$QEMU_PROG" $QEMU_OPTIONS "$@" )
 
 Testing: -drive if=none,file=TEST_DIR/t.qcow2 -drive if=none,file=TEST_DIR/t.qcow2.2 -global isa-fdc.driveB=none0 -device floppy,drive=none1,unit=0
-QEMU_PROG: warning: warning: property isa-fdc.driveB is deprecated
-Use -device floppy,unit=1,drive=... instead.
-
-          dev: isa-fdc, id ""
---
+fi; VALGRIND_QEMU="${VALGRIND_QEMU_VM}" _qemu_proc_exec "${VALGRIND_LOGFILE}" "$QEMU_PROG" $QEMU_OPTIONS "$@" )
 
 Testing: -drive if=none,file=TEST_DIR/t.qcow2 -drive if=none,file=TEST_DIR/t.qcow2.2 -global isa-fdc.driveA=none0 -device floppy,drive=none1,unit=0
-QEMU_PROG: warning: warning: property isa-fdc.driveA is deprecated
-Use -device floppy,unit=0,drive=... instead.
-QEMU_PROG: -device floppy,drive=none1,unit=0: Floppy unit 0 is in use
+QEMU_PROG: /tmp/qemu-test/src/memory.c:1489: memory_region_init_io: Assertion `ops->read || ops->read_with_attrs' failed.
---
+fi; VALGRIND_QEMU="${VALGRIND_QEMU_VM}" _qemu_proc_exec "${VALGRIND_LOGFILE}" "$QEMU_PROG" $QEMU_OPTIONS "$@" )
 
 Testing: -drive if=none,file=TEST_DIR/t.qcow2 -drive if=none,file=TEST_DIR/t.qcow2.2 -global isa-fdc.driveB=none0 -device floppy,drive=none1,unit=1
-QEMU_PROG: warning: warning: property isa-fdc.driveB is deprecated
-Use -device floppy,unit=1,drive=... instead.
-QEMU_PROG: -device floppy,drive=none1,unit=1: Floppy unit 1 is in use
+QEMU_PROG: /tmp/qemu-test/src/memory.c:1489: memory_region_init_io: Assertion `ops->read || ops->read_with_attrs' failed.
---
 === Too many floppy drives ===
 
 Testing: -drive if=floppy,file=TEST_DIR/t.qcow2 -drive if=none,file=TEST_DIR/t.qcow2.2 -drive if=none,file=TEST_DIR/t.qcow2.3 -global isa-fdc.driveB=none0 -device floppy,drive=none1
-QEMU_PROG: warning: warning: property isa-fdc.driveB is deprecated
-Use -device floppy,unit=1,drive=... instead.
-QEMU_PROG: -device floppy,drive=none1: Can't create floppy unit 2, bus supports only 2 units
+QEMU_PROG: /tmp/qemu-test/src/memory.c:1489: memory_region_init_io: Assertion `ops->read || ops->read_with_attrs' failed.
---
-{"data": {"status": "setup"}, "event": "MIGRATION", "timestamp": {"microseconds": "USECS", "seconds": "SECS"}}
-{"data": {"status": "active"}, "event": "MIGRATION", "timestamp": {"microseconds": "USECS", "seconds": "SECS"}}
-{"data": {"status": "completed"}, "event": "MIGRATION", "timestamp": {"microseconds": "USECS", "seconds": "SECS"}}
+WARNING:qemu.machine:qemu received signal 6: /tmp/qemu-test/build/tests/qemu-iotests/../../x86_64-softmmu/qemu-system-x86_64 -display none -vga none -chardev socket,id=mon,path=/tmp/tmp.6XQrnYb2wb/qemu-4538-monitor.sock -mon chardev=mon,mode=control -qtest unix:path=/tmp/tmp.6XQrnYb2wb/qemu-4538-qtest.sock -accel qtest -nodefaults -display none -accel qtest -object iothread,id=iothread0 -drive if=none,id=drive0,file=/tmp/qemu-test/4538-disk0.img,format=qcow2,cache=writeback,aio=threads,node-name=drive0-node -drive if=none,id=drive1,file=/tmp/qemu-test/4538-disk1.img,format=qcow2,cache=writeback,aio=threads,node-name=drive1-node
+WARNING:qemu.machine:qemu received signal 6: /tmp/qemu-test/build/tests/qemu-iotests/../../x86_64-softmmu/qemu-system-x86_64 -display none -vga none -chardev socket,id=mon,path=/tmp/tmp.6XQrnYb2wb/qemu-4538-monitor.sock -mon chardev=mon,mode=control -qtest unix:path=/tmp/tmp.6XQrnYb2wb/qemu-4538-qtest.sock -accel qtest -nodefaults -display none -accel qtest -object iothread,id=iothread0 -drive if=none,id=drive0,file=/tmp/qemu-test/4538-disk0.img,format=qcow2,cache=writeback,aio=threads,node-name=drive0-node -drive if=none,id=drive1,file=/tmp/qemu-test/4538-disk1.img,format=qcow2,cache=writeback,aio=threads,node-name=drive1-node
+Traceback (most recent call last):
+  File "203", line 41, in <module>
+    .add_drive(disk1_img_path, 'node-name=drive1-node', interface='none')
---
-{"data": {"device": "j3", "len": 0, "offset": 0, "speed": 0, "type": "backup"}, "event": "BLOCK_JOB_COMPLETED", "timestamp": {"microseconds": "USECS", "seconds": "SECS"}}
-
---- Done ---
+WARNING:qemu.machine:qemu received signal 6: /tmp/qemu-test/build/tests/qemu-iotests/../../x86_64-softmmu/qemu-system-x86_64 -display none -vga none -chardev socket,id=mon,path=/tmp/tmp.6XQrnYb2wb/qemu-6301-monitor.sock -mon chardev=mon,mode=control -qtest unix:path=/tmp/tmp.6XQrnYb2wb/qemu-6301-qtest.sock -accel qtest -nodefaults -display none -accel qtest -object iothread,id=iothread0 -object iothread,id=iothread1 -device virtio-scsi-pci,id=scsi0,iothread=iothread0 -device virtio-scsi-pci,id=scsi1,iothread=iothread1 -drive if=none,id=drive0,file=/tmp/qemu-test/6301-img0,format=qcow2,cache=writeback,aio=threads -device scsi-hd,id=device0,drive=drive0,bus=scsi0.0 -drive if=none,id=drive1,file=/tmp/qemu-test/6301-img1,format=qcow2,cache=writeback,aio=threads -device scsi-hd,id=device1,drive=drive1,bus=scsi1.0
+WARNING:qemu.machine:qemu received signal 6: /tmp/qemu-test/build/tests/qemu-iotests/../../x86_64-softmmu/qemu-system-x86_64 -display none -vga none -chardev socket,id=mon,path=/tmp/tmp.6XQrnYb2wb/qemu-6301-monitor.sock -mon chardev=mon,mode=control -qtest unix:path=/tmp/tmp.6XQrnYb2wb/qemu-6301-qtest.sock -accel qtest -nodefaults -display none -accel qtest -object iothread,id=iothread0 -object iothread,id=iothread1 -device virtio-scsi-pci,id=scsi0,iothread=iothread0 -device virtio-scsi-pci,id=scsi1,iothread=iothread1 -drive if=none,id=drive0,file=/tmp/qemu-test/6301-img0,format=qcow2,cache=writeback,aio=threads -device scsi-hd,id=device0,drive=drive0,bus=scsi0.0 -drive if=none,id=drive1,file=/tmp/qemu-test/6301-img1,format=qcow2,cache=writeback,aio=threads -device scsi-hd,id=device1,drive=drive1,bus=scsi1.0
+Traceback (most recent call last):
+  File "256", line 73, in <module>
+    vm.launch()
---
-{"return": {}}
-{"execute": "blockdev-backup", "arguments": {"device": "source", "sync": "full", "target": "target"}}
-{"error": {"class": "GenericError", "desc": "Cannot set permissions for backup-top filter: Conflicts with use by other as 'image', which uses 'write' on base"}}
+WARNING:qemu.machine:qemu received signal 6: /tmp/qemu-test/build/tests/qemu-iotests/../../x86_64-softmmu/qemu-system-x86_64 -display none -vga none -chardev socket,id=mon,path=/tmp/tmp.6XQrnYb2wb/qemu-6603-monitor.sock -mon chardev=mon,mode=control -qtest unix:path=/tmp/tmp.6XQrnYb2wb/qemu-6603-qtest.sock -accel qtest -nodefaults -display none -accel qtest
+Traceback (most recent call last):
+  File "283", line 75, in <module>
+    vm.launch()
---
Some cases not run in: 030 041
Failures: 030 040 041 060 117 127 140 141 143 156 161 172 176 181 191 192 195 203 229 249 256 283
Failed 22 of 113 iotests
make: *** [check-tests/check-block.sh] Error 1
Traceback (most recent call last):
  File "./tests/docker/docker.py", line 669, in <module>
    sys.exit(main())
---
    raise CalledProcessError(retcode, cmd)
subprocess.CalledProcessError: Command '['sudo', '-n', 'docker', 'run', '--label', 'com.qemu.instance.uuid=aed4d85c6bd6443c8794304bbdc659c8', '-u', '1001', '--security-opt', 'seccomp=unconfined', '--rm', '-e', 'TARGET_LIST=', '-e', 'EXTRA_CONFIGURE_OPTS=', '-e', 'V=', '-e', 'J=14', '-e', 'DEBUG=', '-e', 'SHOW_ENV=1', '-e', 'CCACHE_DIR=/var/tmp/ccache', '-v', '/home/patchew/.cache/qemu-docker-ccache:/var/tmp/ccache:z', '-v', '/var/tmp/patchew-tester-tmp-50qqcu4z/src/docker-src.2020-06-30-08.50.01.29051:/var/tmp/qemu:z,ro', 'qemu:centos7', '/var/tmp/qemu/run', 'test-quick']' returned non-zero exit status 2.
filter=--filter=label=com.qemu.instance.uuid=aed4d85c6bd6443c8794304bbdc659c8
make[1]: *** [docker-run] Error 1
make[1]: Leaving directory `/var/tmp/patchew-tester-tmp-50qqcu4z/src'
make: *** [docker-run-test-quick@centos7] Error 2

real    56m20.186s
user    0m9.424s


The full log is available at
http://patchew.org/logs/20200630122710.1119158-1-ppandit@redhat.com/testing.docker-quick@centos7/?type=message.
---
Email generated automatically by Patchew [https://patchew.org/].
Please send your feedback to patchew-devel@redhat.com