[PATCH v2 0/1] virtio: fix IO request length in virtio SCSI/block

Denis Plotnikov posted 1 patch 1 week ago
Test docker-mingw@fedora passed
Test docker-clang@ubuntu passed
Test docker-quick@centos7 failed
Test asan passed
Test checkpatch passed
Test FreeBSD passed
Patches applied successfully (tree, apply log)
git fetch https://github.com/patchew-project/qemu tags/patchew/20191108134249.19004-1-dplotnikov@virtuozzo.com
Maintainers: "Michael S. Tsirkin" <mst@redhat.com>, Fam Zheng <fam@euphon.net>, Stefan Hajnoczi <stefanha@redhat.com>, Paolo Bonzini <pbonzini@redhat.com>, Kevin Wolf <kwolf@redhat.com>, Max Reitz <mreitz@redhat.com>
hw/block/virtio-blk.c | 2 +-
hw/scsi/virtio-scsi.c | 2 +-
2 files changed, 2 insertions(+), 2 deletions(-)

[PATCH v2 0/1] virtio: fix IO request length in virtio SCSI/block

Posted by Denis Plotnikov 1 week ago
v2:
  * the standalone patch to make seg_max virtqueue size dependent
  * other patches are postponed
  
v1:
  the initial series

Denis Plotnikov (1):
  virtio: make seg_max virtqueue size dependent

 hw/block/virtio-blk.c | 2 +-
 hw/scsi/virtio-scsi.c | 2 +-
 2 files changed, 2 insertions(+), 2 deletions(-)

-- 
2.17.0


Re: [PATCH v2 0/1] virtio: fix IO request length in virtio SCSI/block

Posted by no-reply@patchew.org 6 days ago
Patchew URL: https://patchew.org/QEMU/20191108134249.19004-1-dplotnikov@virtuozzo.com/



Hi,

This series failed the docker-quick@centos7 build test. Please find the testing commands and
their output below. If you have Docker installed, you can probably reproduce it
locally.

=== TEST SCRIPT BEGIN ===
#!/bin/bash
make docker-image-centos7 V=1 NETWORK=1
time make docker-test-quick@centos7 SHOW_ENV=1 J=14 NETWORK=1
=== TEST SCRIPT END ===

  TEST    check-qtest-x86_64: tests/ahci-test
  TEST    check-unit: tests/test-aio-multithread
test-aio-multithread: /tmp/qemu-test/src/util/async.c:279: aio_ctx_finalize: Assertion `((&ctx->scheduled_coroutines)->slh_first == ((void *)0))' failed.
ERROR - too few tests run (expected 6, got 2)
make: *** [check-unit] Error 1
make: *** Waiting for unfinished jobs....
  TEST    iotest-qcow2: 013
  TEST    iotest-qcow2: 017
---
    raise CalledProcessError(retcode, cmd)
subprocess.CalledProcessError: Command '['sudo', '-n', 'docker', 'run', '--label', 'com.qemu.instance.uuid=66f67685ef3547788ddbfca43e0e9250', '-u', '1001', '--security-opt', 'seccomp=unconfined', '--rm', '-e', 'TARGET_LIST=', '-e', 'EXTRA_CONFIGURE_OPTS=', '-e', 'V=', '-e', 'J=14', '-e', 'DEBUG=', '-e', 'SHOW_ENV=1', '-e', 'CCACHE_DIR=/var/tmp/ccache', '-v', '/home/patchew/.cache/qemu-docker-ccache:/var/tmp/ccache:z', '-v', '/var/tmp/patchew-tester-tmp-oc5hqlfd/src/docker-src.2019-11-08-14.32.14.21571:/var/tmp/qemu:z,ro', 'qemu:centos7', '/var/tmp/qemu/run', 'test-quick']' returned non-zero exit status 2.
filter=--filter=label=com.qemu.instance.uuid=66f67685ef3547788ddbfca43e0e9250
make[1]: *** [docker-run] Error 1
make[1]: Leaving directory `/var/tmp/patchew-tester-tmp-oc5hqlfd/src'
make: *** [docker-run-test-quick@centos7] Error 2

real    11m1.820s
user    0m8.507s


The full log is available at
http://patchew.org/logs/20191108134249.19004-1-dplotnikov@virtuozzo.com/testing.docker-quick@centos7/?type=message.
---
Email generated automatically by Patchew [https://patchew.org/].
Please send your feedback to patchew-devel@redhat.com