[PATCH 0/2] Add AVX512F optimization option and buffer_zero_avx512()

Robert Hoo posted 2 patches 4 days ago
Test docker-quick@centos7 failed
Test FreeBSD passed
Test docker-mingw@fedora passed
Test checkpatch passed
Patches applied successfully (tree, apply log)
git fetch https://github.com/patchew-project/qemu tags/patchew/1581580379-54109-1-git-send-email-robert.hu@linux.intel.com
configure            | 39 ++++++++++++++++++++++++++++++++++++
include/qemu/cpuid.h |  3 +++
util/bufferiszero.c  | 56 +++++++++++++++++++++++++++++++++++++++++++++++++---
3 files changed, 95 insertions(+), 3 deletions(-)

[PATCH 0/2] Add AVX512F optimization option and buffer_zero_avx512()

Posted by Robert Hoo 4 days ago
1. Add avx512_opt option and enable it when host has the ability

2. Implement new buffer_zero_avx512() with AVX512F instructions

Robert Hoo (2):
  configure: add configure option avx512f_opt
  util: add function buffer_zero_avx512()

 configure            | 39 ++++++++++++++++++++++++++++++++++++
 include/qemu/cpuid.h |  3 +++
 util/bufferiszero.c  | 56 +++++++++++++++++++++++++++++++++++++++++++++++++---
 3 files changed, 95 insertions(+), 3 deletions(-)

-- 
1.8.3.1


Re: [PATCH 0/2] Add AVX512F optimization option and buffer_zero_avx512()

Posted by no-reply@patchew.org 4 days ago
Patchew URL: https://patchew.org/QEMU/1581580379-54109-1-git-send-email-robert.hu@linux.intel.com/



Hi,

This series failed the docker-quick@centos7 build test. Please find the testing commands and
their output below. If you have Docker installed, you can probably reproduce it
locally.

=== TEST SCRIPT BEGIN ===
#!/bin/bash
make docker-image-centos7 V=1 NETWORK=1
time make docker-test-quick@centos7 SHOW_ENV=1 J=14 NETWORK=1
=== TEST SCRIPT END ===

qemu-system-aarch64: check_section_footer: Read section footer failed: -5
qemu-system-aarch64: load of migration failed: Invalid argument
/tmp/qemu-test/src/tests/qtest/libqtest.c:140: kill_qemu() tried to terminate QEMU process but encountered exit status 1 (expected 0)
ERROR - too few tests run (expected 15, got 2)
make: *** [check-qtest-aarch64] Error 1
make: *** Waiting for unfinished jobs....
  TEST    check-unit: tests/test-bitmap
  TEST    check-unit: tests/test-aio
---
qemu-system-x86_64: check_section_footer: Read section footer failed: -5
qemu-system-x86_64: load of migration failed: Invalid argument
/tmp/qemu-test/src/tests/qtest/libqtest.c:140: kill_qemu() tried to terminate QEMU process but encountered exit status 1 (expected 0)
ERROR - too few tests run (expected 74, got 62)
make: *** [check-qtest-x86_64] Error 1
  TEST    check-unit: tests/test-bufferiszero
ERROR - too few tests run (expected 1, got 0)
make: *** [check-unit] Error 1
  TEST    iotest-qcow2: 030 [fail]
QEMU          -- "/tmp/qemu-test/build/tests/qemu-iotests/../../x86_64-softmmu/qemu-system-x86_64" -nodefaults -display none -accel qtest
QEMU_IMG      -- "/tmp/qemu-test/build/tests/qemu-iotests/../../qemu-img" 
---
+++ /tmp/qemu-test/build/tests/qemu-iotests/030.out.bad 2020-02-13 08:33:05.905912850 +0000
@@ -1,5 +1,335 @@
-...........................
+WARNING:qemu.machine:qemu received signal 4: /tmp/qemu-test/build/tests/qemu-iotests/../../x86_64-softmmu/qemu-system-x86_64 -display none -vga none -chardev socket,id=mon,path=/tmp/tmp.90Fwth2KCH/qemu-16248-monitor.sock -mon chardev=mon,mode=control -qtest unix:path=/tmp/tmp.90Fwth2KCH/qemu-16248-qtest.sock -accel qtest -nodefaults -display none -accel qtest -drive if=virtio,id=drive0,file=/tmp/qemu-test/test.img,format=qcow2,cache=writeback,aio=threads
+WARNING:qemu.machine:qemu received signal 4: /tmp/qemu-test/build/tests/qemu-iotests/../../x86_64-softmmu/qemu-system-x86_64 -display none -vga none -chardev socket,id=mon,path=/tmp/tmp.90Fwth2KCH/qemu-16248-monitor.sock -mon chardev=mon,mode=control -qtest unix:path=/tmp/tmp.90Fwth2KCH/qemu-16248-qtest.sock -accel qtest -nodefaults -display none -accel qtest -drive if=virtio,id=drive0,file=/tmp/qemu-test/test.img,format=qcow2,cache=writeback,aio=threads
+WARNING:qemu.machine:qemu received signal 4: /tmp/qemu-test/build/tests/qemu-iotests/../../x86_64-softmmu/qemu-system-x86_64 -display none -vga none -chardev socket,id=mon,path=/tmp/tmp.90Fwth2KCH/qemu-16248-monitor.sock -mon chardev=mon,mode=control -qtest unix:path=/tmp/tmp.90Fwth2KCH/qemu-16248-qtest.sock -accel qtest -nodefaults -display none -accel qtest -drive if=virtio,id=drive0,file=/tmp/qemu-test/test.img,format=qcow2,cache=writeback,aio=threads
+WARNING:qemu.machine:qemu received signal 4: /tmp/qemu-test/build/tests/qemu-iotests/../../x86_64-softmmu/qemu-system-x86_64 -display none -vga none -chardev socket,id=mon,path=/tmp/tmp.90Fwth2KCH/qemu-16248-monitor.sock -mon chardev=mon,mode=control -qtest unix:path=/tmp/tmp.90Fwth2KCH/qemu-16248-qtest.sock -accel qtest -nodefaults -display none -accel qtest -drive if=virtio,id=drive0,file=/tmp/qemu-test/test.img,format=qcow2,cache=writeback,aio=threads
+WARNING:qemu.machine:qemu received signal 4: /tmp/qemu-test/build/tests/qemu-iotests/../../x86_64-softmmu/qemu-system-x86_64 -display none -vga none -chardev socket,id=mon,path=/tmp/tmp.90Fwth2KCH/qemu-16248-monitor.sock -mon chardev=mon,mode=control -qtest unix:path=/tmp/tmp.90Fwth2KCH/qemu-16248-qtest.sock -accel qtest -nodefaults -display none -accel qtest -drive if=virtio,id=drive0,file=/tmp/qemu-test/test.img,format=qcow2,cache=writeback,aio=threads
+WARNING:qemu.machine:qemu received signal 4: /tmp/qemu-test/build/tests/qemu-iotests/../../x86_64-softmmu/qemu-system-x86_64 -display none -vga none -chardev socket,id=mon,path=/tmp/tmp.90Fwth2KCH/qemu-16248-monitor.sock -mon chardev=mon,mode=control -qtest unix:path=/tmp/tmp.90Fwth2KCH/qemu-16248-qtest.sock -accel qtest -nodefaults -display none -accel qtest -drive if=virtio,id=drive0,file=/tmp/qemu-test/img-8.img,format=qcow2,cache=writeback,aio=threads,backing.backing.backing.backing.backing.backing.backing.backing.node-name=node0,backing.backing.backing.backing.backing.backing.backing.node-name=node1,backing.backing.backing.backing.backing.backing.node-name=node2,backing.backing.backing.backing.backing.node-name=node3,backing.backing.backing.backing.node-name=node4,backing.backing.backing.node-name=node5,backing.backing.node-name=node6,backing.node-name=node7,node-name=node8
+WARNING:qemu.machine:qemu received signal 4: /tmp/qemu-test/build/tests/qemu-iotests/../../x86_64-softmmu/qemu-system-x86_64 -display none -vga none -chardev socket,id=mon,path=/tmp/tmp.90Fwth2KCH/qemu-16248-monitor.sock -mon chardev=mon,mode=control -qtest unix:path=/tmp/tmp.90Fwth2KCH/qemu-16248-qtest.sock -accel qtest -nodefaults -display none -accel qtest -drive if=virtio,id=drive0,file=/tmp/qemu-test/img-8.img,format=qcow2,cache=writeback,aio=threads,backing.backing.backing.backing.backing.backing.backing.backing.node-name=node0,backing.backing.backing.backing.backing.backing.backing.node-name=node1,backing.backing.backing.backing.backing.backing.node-name=node2,backing.backing.backing.backing.backing.node-name=node3,backing.backing.backing.backing.node-name=node4,backing.backing.backing.node-name=node5,backing.backing.node-name=node6,backing.node-name=node7,node-name=node8
+WARNING:qemu.machine:qemu received signal 4: /tmp/qemu-test/build/tests/qemu-iotests/../../x86_64-softmmu/qemu-system-x86_64 -display none -vga none -chardev socket,id=mon,path=/tmp/tmp.90Fwth2KCH/qemu-16248-monitor.sock -mon chardev=mon,mode=control -qtest unix:path=/tmp/tmp.90Fwth2KCH/qemu-16248-qtest.sock -accel qtest -nodefaults -display none -accel qtest -drive if=virtio,id=drive0,file=/tmp/qemu-test/img-8.img,format=qcow2,cache=writeback,aio=threads,backing.backing.backing.backing.backing.backing.backing.backing.node-name=node0,backing.backing.backing.backing.backing.backing.backing.node-name=node1,backing.backing.backing.backing.backing.backing.node-name=node2,backing.backing.backing.backing.backing.node-name=node3,backing.backing.backing.backing.node-name=node4,backing.backing.backing.node-name=node5,backing.backing.node-name=node6,backing.node-name=node7,node-name=node8
+WARNING:qemu.machine:qemu received signal 4: /tmp/qemu-test/build/tests/qemu-iotests/../../x86_64-softmmu/qemu-system-x86_64 -display none -vga none -chardev socket,id=mon,path=/tmp/tmp.90Fwth2KCH/qemu-16248-monitor.sock -mon chardev=mon,mode=control -qtest unix:path=/tmp/tmp.90Fwth2KCH/qemu-16248-qtest.sock -accel qtest -nodefaults -display none -accel qtest -drive if=virtio,id=drive0,file=/tmp/qemu-test/img-8.img,format=qcow2,cache=writeback,aio=threads,backing.backing.backing.backing.backing.backing.backing.backing.node-name=node0,backing.backing.backing.backing.backing.backing.backing.node-name=node1,backing.backing.backing.backing.backing.backing.node-name=node2,backing.backing.backing.backing.backing.node-name=node3,backing.backing.backing.backing.node-name=node4,backing.backing.backing.node-name=node5,backing.backing.node-name=node6,backing.node-name=node7,node-name=node8
+WARNING:qemu.machine:qemu received signal 4: /tmp/qemu-test/build/tests/qemu-iotests/../../x86_64-softmmu/qemu-system-x86_64 -display none -vga none -chardev socket,id=mon,path=/tmp/tmp.90Fwth2KCH/qemu-16248-monitor.sock -mon chardev=mon,mode=control -qtest unix:path=/tmp/tmp.90Fwth2KCH/qemu-16248-qtest.sock -accel qtest -nodefaults -display none -accel qtest -drive if=virtio,id=drive0,file=/tmp/qemu-test/img-8.img,format=qcow2,cache=writeback,aio=threads,backing.backing.backing.backing.backing.backing.backing.backing.node-name=node0,backing.backing.backing.backing.backing.backing.backing.node-name=node1,backing.backing.backing.backing.backing.backing.node-name=node2,backing.backing.backing.backing.backing.node-name=node3,backing.backing.backing.backing.node-name=node4,backing.backing.backing.node-name=node5,backing.backing.node-name=node6,backing.node-name=node7,node-name=node8
+WARNING:qemu.machine:qemu received signal 4: /tmp/qemu-test/build/tests/qemu-iotests/../../x86_64-softmmu/qemu-system-x86_64 -display none -vga none -chardev socket,id=mon,path=/tmp/tmp.90Fwth2KCH/qemu-16248-monitor.sock -mon chardev=mon,mode=control -qtest unix:path=/tmp/tmp.90Fwth2KCH/qemu-16248-qtest.sock -accel qtest -nodefaults -display none -accel qtest -drive if=virtio,id=drive0,file=/tmp/qemu-test/img-8.img,format=qcow2,cache=writeback,aio=threads,backing.backing.backing.backing.backing.backing.backing.backing.node-name=node0,backing.backing.backing.backing.backing.backing.backing.node-name=node1,backing.backing.backing.backing.backing.backing.node-name=node2,backing.backing.backing.backing.backing.node-name=node3,backing.backing.backing.backing.node-name=node4,backing.backing.backing.node-name=node5,backing.backing.node-name=node6,backing.node-name=node7,node-name=node8
+WARNING:qemu.machine:qemu received signal 4: /tmp/qemu-test/build/tests/qemu-iotests/../../x86_64-softmmu/qemu-system-x86_64 -display none -vga none -chardev socket,id=mon,path=/tmp/tmp.90Fwth2KCH/qemu-16248-monitor.sock -mon chardev=mon,mode=control -qtest unix:path=/tmp/tmp.90Fwth2KCH/qemu-16248-qtest.sock -accel qtest -nodefaults -display none -accel qtest -drive if=virtio,id=drive0,driver=quorum,vote-threshold=2,children.0.file.filename=/tmp/qemu-test/img-0.img,children.0.node-name=node0,children.1.file.filename=/tmp/qemu-test/img-1.img,children.1.node-name=node1,children.2.file.filename=/tmp/qemu-test/img-2.img,children.2.node-name=node2
+WARNING:qemu.machine:qemu received signal 4: /tmp/qemu-test/build/tests/qemu-iotests/../../x86_64-softmmu/qemu-system-x86_64 -display none -vga none -chardev socket,id=mon,path=/tmp/tmp.90Fwth2KCH/qemu-16248-monitor.sock -mon chardev=mon,mode=control -qtest unix:path=/tmp/tmp.90Fwth2KCH/qemu-16248-qtest.sock -accel qtest -nodefaults -display none -accel qtest -drive if=virtio,id=drive0,file=blkdebug::/tmp/qemu-test/test.img,format=qcow2,cache=writeback,aio=threads
+WARNING:qemu.machine:qemu received signal 4: /tmp/qemu-test/build/tests/qemu-iotests/../../x86_64-softmmu/qemu-system-x86_64 -display none -vga none -chardev socket,id=mon,path=/tmp/tmp.90Fwth2KCH/qemu-16248-monitor.sock -mon chardev=mon,mode=control -qtest unix:path=/tmp/tmp.90Fwth2KCH/qemu-16248-qtest.sock -accel qtest -nodefaults -display none -accel qtest -drive if=virtio,id=drive0,file=blkdebug::/tmp/qemu-test/test.img,format=qcow2,cache=writeback,aio=threads
+WARNING:qemu.machine:qemu received signal 4: /tmp/qemu-test/build/tests/qemu-iotests/../../x86_64-softmmu/qemu-system-x86_64 -display none -vga none -chardev socket,id=mon,path=/tmp/tmp.90Fwth2KCH/qemu-16248-monitor.sock -mon chardev=mon,mode=control -qtest unix:path=/tmp/tmp.90Fwth2KCH/qemu-16248-qtest.sock -accel qtest -nodefaults -display none -accel qtest -drive if=virtio,id=drive0,file=blkdebug::/tmp/qemu-test/test.img,format=qcow2,cache=writeback,aio=threads,backing.node-name=mid,backing.backing.node-name=base
+WARNING:qemu.machine:qemu received signal 4: /tmp/qemu-test/build/tests/qemu-iotests/../../x86_64-softmmu/qemu-system-x86_64 -display none -vga none -chardev socket,id=mon,path=/tmp/tmp.90Fwth2KCH/qemu-16248-monitor.sock -mon chardev=mon,mode=control -qtest unix:path=/tmp/tmp.90Fwth2KCH/qemu-16248-qtest.sock -accel qtest -nodefaults -display none -accel qtest -drive if=virtio,id=drive0,file=blkdebug::/tmp/qemu-test/test.img,format=qcow2,cache=writeback,aio=threads,backing.node-name=mid,backing.backing.node-name=base
+WARNING:qemu.machine:qemu received signal 4: /tmp/qemu-test/build/tests/qemu-iotests/../../x86_64-softmmu/qemu-system-x86_64 -display none -vga none -chardev socket,id=mon,path=/tmp/tmp.90Fwth2KCH/qemu-16248-monitor.sock -mon chardev=mon,mode=control -qtest unix:path=/tmp/tmp.90Fwth2KCH/qemu-16248-qtest.sock -accel qtest -nodefaults -display none -accel qtest -drive if=virtio,id=drive0,file=blkdebug::/tmp/qemu-test/test.img,format=qcow2,cache=writeback,aio=threads,backing.node-name=mid,backing.backing.node-name=base
+WARNING:qemu.machine:qemu received signal 4: /tmp/qemu-test/build/tests/qemu-iotests/../../x86_64-softmmu/qemu-system-x86_64 -display none -vga none -chardev socket,id=mon,path=/tmp/tmp.90Fwth2KCH/qemu-16248-monitor.sock -mon chardev=mon,mode=control -qtest unix:path=/tmp/tmp.90Fwth2KCH/qemu-16248-qtest.sock -accel qtest -nodefaults -display none -accel qtest -drive if=virtio,id=drive0,file=blkdebug::/tmp/qemu-test/test.img,format=qcow2,cache=writeback,aio=threads,backing.node-name=mid,backing.backing.node-name=base
+EEEEEE...EEFFFEEE...EE.EEEE
+======================================================================
+ERROR: test_enospc (__main__.TestEIO)
+----------------------------------------------------------------------
+Traceback (most recent call last):
+  File "030", line 765, in test_enospc
---
+  File "/tmp/qemu-test/src/tests/qemu-iotests/../../python/qemu/qmp.py", line 260, in get_events
+    self.__get_events(wait)
+  File "/tmp/qemu-test/src/tests/qemu-iotests/../../python/qemu/qmp.py", line 135, in __get_events
+    raise QMPConnectError("Error while reading from socket")
+qemu.qmp.QMPConnectError: Error while reading from socket
+
+======================================================================
+ERROR: test_ignore (__main__.TestEIO)
+----------------------------------------------------------------------
+Traceback (most recent call last):
+  File "030", line 689, in test_ignore
---
+  File "/tmp/qemu-test/src/tests/qemu-iotests/../../python/qemu/qmp.py", line 260, in get_events
+    self.__get_events(wait)
+  File "/tmp/qemu-test/src/tests/qemu-iotests/../../python/qemu/qmp.py", line 135, in __get_events
+    raise QMPConnectError("Error while reading from socket")
+qemu.qmp.QMPConnectError: Error while reading from socket
+
+======================================================================
+ERROR: test_report (__main__.TestEIO)
+----------------------------------------------------------------------
+Traceback (most recent call last):
+  File "030", line 661, in test_report
---
+  File "/tmp/qemu-test/src/tests/qemu-iotests/../../python/qemu/qmp.py", line 260, in get_events
+    self.__get_events(wait)
+  File "/tmp/qemu-test/src/tests/qemu-iotests/../../python/qemu/qmp.py", line 135, in __get_events
+    raise QMPConnectError("Error while reading from socket")
+qemu.qmp.QMPConnectError: Error while reading from socket
+
+======================================================================
+ERROR: test_stop (__main__.TestEIO)
+----------------------------------------------------------------------
+Traceback (most recent call last):
+  File "030", line 722, in test_stop
---
+  File "/tmp/qemu-test/src/tests/qemu-iotests/../../python/qemu/qmp.py", line 260, in get_events
+    self.__get_events(wait)
+  File "/tmp/qemu-test/src/tests/qemu-iotests/../../python/qemu/qmp.py", line 135, in __get_events
+    raise QMPConnectError("Error while reading from socket")
+qemu.qmp.QMPConnectError: Error while reading from socket
+
+======================================================================
+ERROR: test_enospc (__main__.TestENOSPC)
+----------------------------------------------------------------------
+Traceback (most recent call last):
+  File "030", line 811, in test_enospc
---
+  File "/tmp/qemu-test/src/tests/qemu-iotests/../../python/qemu/qmp.py", line 260, in get_events
+    self.__get_events(wait)
+  File "/tmp/qemu-test/src/tests/qemu-iotests/../../python/qemu/qmp.py", line 135, in __get_events
+    raise QMPConnectError("Error while reading from socket")
+qemu.qmp.QMPConnectError: Error while reading from socket
+
+======================================================================
+ERROR: test_overlapping_1 (__main__.TestParallelOps)
+----------------------------------------------------------------------
+Traceback (most recent call last):
+  File "030", line 279, in test_overlapping_1
---
+ConnectionResetError: [Errno 104] Connection reset by peer
+
+======================================================================
+ERROR: test_overlapping_5 (__main__.TestParallelOps)
+----------------------------------------------------------------------
+Traceback (most recent call last):
+  File "030", line 414, in test_overlapping_5
---
+  File "/tmp/qemu-test/src/tests/qemu-iotests/../../python/qemu/qmp.py", line 240, in pull_event
+    self.__get_events(wait)
+  File "/tmp/qemu-test/src/tests/qemu-iotests/../../python/qemu/qmp.py", line 135, in __get_events
+    raise QMPConnectError("Error while reading from socket")
+qemu.qmp.QMPConnectError: Error while reading from socket
+
+======================================================================
+ERROR: test_stream_base_node_name (__main__.TestParallelOps)
+----------------------------------------------------------------------
+Traceback (most recent call last):
+  File "030", line 519, in test_stream_base_node_name
---
+  File "/tmp/qemu-test/src/tests/qemu-iotests/../../python/qemu/qmp.py", line 260, in get_events
+    self.__get_events(wait)
+  File "/tmp/qemu-test/src/tests/qemu-iotests/../../python/qemu/qmp.py", line 135, in __get_events
+    raise QMPConnectError("Error while reading from socket")
+qemu.qmp.QMPConnectError: Error while reading from socket
+
+======================================================================
+ERROR: test_stream_quorum (__main__.TestQuorum)
+----------------------------------------------------------------------
+Traceback (most recent call last):
+  File "030", line 573, in test_stream_quorum
---
+  File "/tmp/qemu-test/src/tests/qemu-iotests/../../python/qemu/qmp.py", line 260, in get_events
+    self.__get_events(wait)
+  File "/tmp/qemu-test/src/tests/qemu-iotests/../../python/qemu/qmp.py", line 135, in __get_events
+    raise QMPConnectError("Error while reading from socket")
+qemu.qmp.QMPConnectError: Error while reading from socket
+
+======================================================================
+ERROR: test_set_speed (__main__.TestSetSpeed)
+----------------------------------------------------------------------
+Traceback (most recent call last):
+  File "030", line 919, in test_set_speed
---
+ConnectionResetError: [Errno 104] Connection reset by peer
+
+======================================================================
+ERROR: test_set_speed_invalid (__main__.TestSetSpeed)
+----------------------------------------------------------------------
+Traceback (most recent call last):
+  File "030", line 955, in test_set_speed_invalid
---
+ConnectionResetError: [Errno 104] Connection reset by peer
+
+======================================================================
+ERROR: test_stream (__main__.TestSingleDrive)
+----------------------------------------------------------------------
+Traceback (most recent call last):
+  File "030", line 56, in test_stream
---
+  File "/tmp/qemu-test/src/tests/qemu-iotests/../../python/qemu/qmp.py", line 260, in get_events
+    self.__get_events(wait)
+  File "/tmp/qemu-test/src/tests/qemu-iotests/../../python/qemu/qmp.py", line 135, in __get_events
+    raise QMPConnectError("Error while reading from socket")
+qemu.qmp.QMPConnectError: Error while reading from socket
+
+======================================================================
+ERROR: test_stream_intermediate (__main__.TestSingleDrive)
+----------------------------------------------------------------------
+Traceback (most recent call last):
+  File "030", line 75, in test_stream_intermediate
---
+  File "/tmp/qemu-test/src/tests/qemu-iotests/../../python/qemu/qmp.py", line 260, in get_events
+    self.__get_events(wait)
+  File "/tmp/qemu-test/src/tests/qemu-iotests/../../python/qemu/qmp.py", line 135, in __get_events
+    raise QMPConnectError("Error while reading from socket")
+qemu.qmp.QMPConnectError: Error while reading from socket
+
+======================================================================
+ERROR: test_stream_partial (__main__.TestSingleDrive)
+----------------------------------------------------------------------
+Traceback (most recent call last):
+  File "030", line 138, in test_stream_partial
---
+  File "/tmp/qemu-test/src/tests/qemu-iotests/../../python/qemu/qmp.py", line 260, in get_events
+    self.__get_events(wait)
+  File "/tmp/qemu-test/src/tests/qemu-iotests/../../python/qemu/qmp.py", line 135, in __get_events
+    raise QMPConnectError("Error while reading from socket")
+qemu.qmp.QMPConnectError: Error while reading from socket
+
+======================================================================
+ERROR: test_stream_pause (__main__.TestSingleDrive)
+----------------------------------------------------------------------
+Traceback (most recent call last):
+  File "030", line 92, in test_stream_pause
---
+ConnectionResetError: [Errno 104] Connection reset by peer
+
+======================================================================
+ERROR: test_stream (__main__.TestSmallerBackingFile)
+----------------------------------------------------------------------
+Traceback (most recent call last):
+  File "030", line 600, in test_stream
---
+  File "/tmp/qemu-test/src/tests/qemu-iotests/../../python/qemu/qmp.py", line 260, in get_events
+    self.__get_events(wait)
+  File "/tmp/qemu-test/src/tests/qemu-iotests/../../python/qemu/qmp.py", line 135, in __get_events
+    raise QMPConnectError("Error while reading from socket")
+qemu.qmp.QMPConnectError: Error while reading from socket
+
+======================================================================
+ERROR: test_stream_stop (__main__.TestStreamStop)
+----------------------------------------------------------------------
+Traceback (most recent call last):
+  File "030", line 854, in setUp
---
+OSError: [Errno 98] Address already in use
+
+======================================================================
+FAIL: test_stream_commit_1 (__main__.TestParallelOps)
+----------------------------------------------------------------------
+Traceback (most recent call last):
+  File "030", line 431, in test_stream_commit_1
---
+AssertionError: failed path traversal for "return" in "None"
+
+======================================================================
+FAIL: test_stream_commit_2 (__main__.TestParallelOps)
+----------------------------------------------------------------------
+Traceback (most recent call last):
+  File "030", line 463, in test_stream_commit_2
---
+AssertionError: failed path traversal for "return" in "None"
+
+======================================================================
+FAIL: test_stream_parallel (__main__.TestParallelOps)
+----------------------------------------------------------------------
+Traceback (most recent call last):
+  File "030", line 242, in test_stream_parallel
---
 Ran 27 tests
 
-OK
+FAILED (failures=3, errors=17)
  TEST    iotest-qcow2: 031
  TEST    iotest-qcow2: 032
  TEST    iotest-qcow2: 033 [fail]
---
+qemu-img received signal 4: /tmp/qemu-test/build/tests/qemu-iotests/../../qemu-img compare -f qcow2 -F qcow2 /tmp/qemu-test/quorum2.img /tmp/qemu-test/quorum_repair.img
+................FF.....F...................................................................
+======================================================================
+FAIL: test_cancel_after_ready (__main__.TestRepairQuorum)
+----------------------------------------------------------------------
+Traceback (most recent call last):
+  File "041", line 952, in test_cancel_after_ready
---
+AssertionError: False is not true : target image does not match source after mirroring
+
+======================================================================
+FAIL: test_complete (__main__.TestRepairQuorum)
+----------------------------------------------------------------------
+Traceback (most recent call last):
+  File "041", line 922, in test_complete
---
+AssertionError: False is not true : target image does not match source after mirroring
+
+======================================================================
+FAIL: test_pause (__main__.TestRepairQuorum)
+----------------------------------------------------------------------
+Traceback (most recent call last):
+  File "041", line 977, in test_pause
---
 Ran 91 tests
 
-OK
+FAILED (failures=3)
  TEST    iotest-qcow2: 042
  TEST    iotest-qcow2: 043
  TEST    iotest-qcow2: 046
---
 --- Checking and retrying ---
 virtual size: 64 MiB (67108864 bytes)
+Repairing refcount block 1 is outside image
+ERROR cluster 1048576 refcount=0 reference=1
+Rebuilding refcount structure
+Repairing cluster 1 refcount=1 reference=0
+Repairing cluster 2 refcount=1 reference=0
---
+./common.rc: line 136: 24365 Illegal instruction     (core dumped) ( VALGRIND_QEMU="${VALGRIND_QEMU_IMG}" _qemu_proc_exec "${VALGRIND_LOGFILE}" "$QEMU_IMG_PROG" $QEMU_IMG_OPTIONS "$@" )
 --- Repairing ---
 Repairing refcount block 1 is outside image
 ERROR refcount block 2 is not cluster aligned; refcount table entry corrupted
  TEST    iotest-qcow2: 061
  TEST    iotest-qcow2: 062
  TEST    iotest-qcow2: 063 [fail]
---
--- /tmp/qemu-test/src/tests/qemu-iotests/203.out       2020-02-13 07:51:30.000000000 +0000
+++ /tmp/qemu-test/build/tests/qemu-iotests/203.out.bad 2020-02-13 08:37:57.222539469 +0000
@@ -1,3 +1,4 @@
+WARNING:qemu.machine:qemu received signal 4: /tmp/qemu-test/build/tests/qemu-iotests/../../x86_64-softmmu/qemu-system-x86_64 -display none -vga none -chardev socket,id=mon,path=/tmp/tmp.90Fwth2KCH/qemu-26219-monitor.sock -mon chardev=mon,mode=control -qtest unix:path=/tmp/tmp.90Fwth2KCH/qemu-26219-qtest.sock -accel qtest -nodefaults -display none -accel qtest -object iothread,id=iothread0 -drive if=none,id=drive0,file=/tmp/qemu-test/26219-disk0.img,format=qcow2,cache=writeback,aio=threads,node-name=drive0-node -drive if=none,id=drive1,file=/tmp/qemu-test/26219-disk1.img,format=qcow2,cache=writeback,aio=threads,node-name=drive1-node
 Launching VM...
 Setting IOThreads...
 {"return": {}}
---
+  File "/tmp/qemu-test/src/tests/qemu-iotests/../../python/qemu/qmp.py", line 240, in pull_event
+    self.__get_events(wait)
+  File "/tmp/qemu-test/src/tests/qemu-iotests/../../python/qemu/qmp.py", line 135, in __get_events
+    raise QMPConnectError("Error while reading from socket")
+qemu.qmp.QMPConnectError: Error while reading from socket
  TEST    iotest-qcow2: 214
  TEST    iotest-qcow2: 217
  TEST    iotest-qcow2: 220
---
+++ /tmp/qemu-test/build/tests/qemu-iotests/251.out.bad 2020-02-13 08:39:47.528699147 +0000
@@ -5,18 +5,7 @@
 
 qemu-img: warning: error while reading block status at offset status_fail_offset_0: Input/output error
 qemu-img: warning: error while reading block status at offset status_fail_offset_1: Input/output error
-qemu-img: warning: error while reading block status at offset status_fail_offset_0: Input/output error
-qemu-img: warning: error while reading offset read_fail_offset_0: Input/output error
-qemu-img: warning: error while reading block status at offset status_fail_offset_1: Input/output error
-qemu-img: warning: error while reading offset status_fail_offset_1: Input/output error
-qemu-img: warning: error while reading offset read_fail_offset_2: Input/output error
-qemu-img: warning: error while reading offset read_fail_offset_3: Input/output error
-qemu-img: warning: error while reading offset read_fail_offset_4: Input/output error
-qemu-img: warning: error while reading offset read_fail_offset_5: Input/output error
-qemu-img: warning: error while reading offset read_fail_offset_6: Input/output error
-qemu-img: warning: error while reading offset read_fail_offset_7: Input/output error
-qemu-img: warning: error while reading offset read_fail_offset_8: Input/output error
-qemu-img: warning: error while reading offset read_fail_offset_9: Input/output error
+./common.rc: line 136: 28190 Illegal instruction     (core dumped) ( VALGRIND_QEMU="${VALGRIND_QEMU_IMG}" _qemu_proc_exec "${VALGRIND_LOGFILE}" "$QEMU_IMG_PROG" $QEMU_IMG_OPTIONS "$@" )
 
 wrote 512/512 bytes at offset read_fail_offset_0
---
  TEST    iotest-qcow2: 283
Failures: 013 018 019 030 033 041 048 053 060 063 072 086 089 141 181 203 244 251 267
Failed 19 of 116 iotests
make: *** [check-tests/check-block.sh] Error 1
Traceback (most recent call last):
  File "./tests/docker/docker.py", line 664, in <module>
    sys.exit(main())
---
    raise CalledProcessError(retcode, cmd)
subprocess.CalledProcessError: Command '['sudo', '-n', 'docker', 'run', '--label', 'com.qemu.instance.uuid=4541c4db1f564563ad1446ded8f742dd', '-u', '1001', '--security-opt', 'seccomp=unconfined', '--rm', '-e', 'TARGET_LIST=', '-e', 'EXTRA_CONFIGURE_OPTS=', '-e', 'V=', '-e', 'J=14', '-e', 'DEBUG=', '-e', 'SHOW_ENV=1', '-e', 'CCACHE_DIR=/var/tmp/ccache', '-v', '/home/patchew/.cache/qemu-docker-ccache:/var/tmp/ccache:z', '-v', '/var/tmp/patchew-tester-tmp-9s8159vz/src/docker-src.2020-02-13-03.28.34.18967:/var/tmp/qemu:z,ro', 'qemu:centos7', '/var/tmp/qemu/run', 'test-quick']' returned non-zero exit status 2.
filter=--filter=label=com.qemu.instance.uuid=4541c4db1f564563ad1446ded8f742dd
make[1]: *** [docker-run] Error 1
make[1]: Leaving directory `/var/tmp/patchew-tester-tmp-9s8159vz/src'
make: *** [docker-run-test-quick@centos7] Error 2

real    11m30.763s
user    0m9.868s


The full log is available at
http://patchew.org/logs/1581580379-54109-1-git-send-email-robert.hu@linux.intel.com/testing.docker-quick@centos7/?type=message.
---
Email generated automatically by Patchew [https://patchew.org/].
Please send your feedback to patchew-devel@redhat.com