[PATCH v3] piix: fix xenfv regression, add compat machine xenfv-qemu4

Olaf Hering posted 1 patch 1 week ago
Test docker-mingw@fedora passed
Test docker-quick@centos7 failed
Test checkpatch passed
Test FreeBSD passed
Test asan failed
Patches applied successfully (tree, apply log)
git fetch https://github.com/patchew-project/qemu tags/patchew/20200325064736.22416-1-olaf@aepfle.de
Maintainers: "Michael S. Tsirkin" <mst@redhat.com>, Paolo Bonzini <pbonzini@redhat.com>, Richard Henderson <rth@twiddle.net>, Marcel Apfelbaum <marcel.apfelbaum@gmail.com>, Eduardo Habkost <ehabkost@redhat.com>
hw/i386/pc_piix.c | 15 +++++++++++++++
1 file changed, 15 insertions(+)

[PATCH v3] piix: fix xenfv regression, add compat machine xenfv-qemu4

Posted by Olaf Hering 1 week ago
With qemu4 an incompatible change was added to pc_piix, which makes it
practical impossible to migrate domUs started with qemu2 or qemu3 to
newer qemu versions. Commit 7fccf2a06890e3bc3b30e29827ad3fb93fe88fea
added and enabled a new member "smbus_no_migration_support". In commit
4ab2f2a8aabfea95cc53c64e13b3f67960b27fdf the vmstate_acpi got new
elements, which are conditionally filled. As a result, an incoming
migration expected smbus related data unless smbus migration was
disabled for a given MachineClass. Since first commit forgot to handle
'xenfv', domUs started with qemu4 are incompatible with their qemu3
siblings.

Using other existing machine types, such as 'pc-i440fx-3.1', is not
possible because 'xenfv' creates the 'xen-platform' PCI device at
00:02.0, while all other variants to run a domU would create it at
00:04.0.

To cover both the existing and the broken case of 'xenfv' in a single
qemu binary, a new compatibility variant of 'xenfv-qemu4' must be added
which targets domUs started with qemu-4.0, qemu-4.1 and qemu-4.2. The
existing 'xenfv' restores compatibility of qemu5+ with qemu2/3.

Host admins who started domUs with qemu-4.x have to use a wrapper script
which appends '-machine xenfv-qemu4' to the device-model command line.
This is only required if there is no maintenance window which allows to
temporary shutdown the domU and restart it with a fixed device-model.

The wrapper script is as simple as this:
  #!/bin/sh
  exec /usr/bin/qemu-system-i386 "$@" -machine xenfv-qemu4

With xl this script will be enabled with device_model_override=, see
xl.cfg(5). To live migrate a domU, adjust the existing domU.cfg and pass
it to xl migrate or xl save/restore:
  xl migrate -C new-domU.cfg domU remote-host
  xl save domU CheckpointFile new-domU.cfg
  xl restore new-domU.cfg CheckpointFile

With libvirt this script will be enabled with the <emulator> element in
domU.xml. Use 'virsh edit' prior 'virsh migrate' to replace the existing
<emulator> element to point it to the wrapper script.

Signed-off-by: Olaf Hering <olaf@aepfle.de>
---
 hw/i386/pc_piix.c | 15 +++++++++++++++
 1 file changed, 15 insertions(+)

diff --git a/hw/i386/pc_piix.c b/hw/i386/pc_piix.c
index e6756216f9..ef23da88d9 100644
--- a/hw/i386/pc_piix.c
+++ b/hw/i386/pc_piix.c
@@ -948,11 +948,26 @@ DEFINE_PC_MACHINE(isapc, "isapc", pc_init_isa,
 
 
 #ifdef CONFIG_XEN
+static void xenfv_qemu_4_x_machine_options(MachineClass *m)
+{
+    m->desc = "Xen Fully-virtualized PC (qemu 4.x compat)";
+    m->max_cpus = HVM_MAX_VCPUS;
+    m->default_machine_opts = "accel=xen";
+    m->smbus_no_migration_support = false;
+}
+
+DEFINE_PC_MACHINE(xenfv_qemu4, "xenfv-qemu4", pc_xen_hvm_init,
+                  xenfv_qemu_4_x_machine_options);
+
 static void xenfv_machine_options(MachineClass *m)
 {
+    PCMachineClass *pcmc = PC_MACHINE_CLASS(m);
+
     m->desc = "Xen Fully-virtualized PC";
     m->max_cpus = HVM_MAX_VCPUS;
     m->default_machine_opts = "accel=xen";
+    m->smbus_no_migration_support = true;
+    pcmc->pvh_enabled = false;
 }
 
 DEFINE_PC_MACHINE(xenfv, "xenfv", pc_xen_hvm_init,

Re: [PATCH v3] piix: fix xenfv regression, add compat machine xenfv-qemu4

Posted by Paolo Bonzini 1 week ago
On 25/03/20 07:47, Olaf Hering wrote:
> To cover both the existing and the broken case of 'xenfv' in a single
> qemu binary, a new compatibility variant of 'xenfv-qemu4' must be added
> which targets domUs started with qemu-4.0, qemu-4.1 and qemu-4.2. The
> existing 'xenfv' restores compatibility of qemu5+ with qemu2/3.

As mentioned earlier, this is not enough, because migration support is
just the tip of the iceberg.  If you want migration to work, the machine
type must present consistent hardware across all QEMU versions.

The xenfv-qemu4 machine type is still presenting different hardware than
QEMU 4.x (see hw_compat_4_2/hw_compat_4_1/hw_compat_4_0 - what QEMU 4.x
version are you interested in?).  Likewise the xenfv machine type is
still presenting different hardware than QEMU 3.x (same as the above,
plus hw_compat_3_1 and pc_compat_3_1).

Paolo

> ---
>  hw/i386/pc_piix.c | 15 +++++++++++++++
>  1 file changed, 15 insertions(+)
> 
> diff --git a/hw/i386/pc_piix.c b/hw/i386/pc_piix.c
> index e6756216f9..ef23da88d9 100644
> --- a/hw/i386/pc_piix.c
> +++ b/hw/i386/pc_piix.c
> @@ -948,11 +948,26 @@ DEFINE_PC_MACHINE(isapc, "isapc", pc_init_isa,
>  
>  
>  #ifdef CONFIG_XEN
> +static void xenfv_qemu_4_x_machine_options(MachineClass *m)
> +{
> +    m->desc = "Xen Fully-virtualized PC (qemu 4.x compat)";
> +    m->max_cpus = HVM_MAX_VCPUS;
> +    m->default_machine_opts = "accel=xen";
> +    m->smbus_no_migration_support = false;
> +}
> +
> +DEFINE_PC_MACHINE(xenfv_qemu4, "xenfv-qemu4", pc_xen_hvm_init,
> +                  xenfv_qemu_4_x_machine_options);
> +
>  static void xenfv_machine_options(MachineClass *m)
>  {
> +    PCMachineClass *pcmc = PC_MACHINE_CLASS(m);
> +
>      m->desc = "Xen Fully-virtualized PC";
>      m->max_cpus = HVM_MAX_VCPUS;
>      m->default_machine_opts = "accel=xen";
> +    m->smbus_no_migration_support = true;
> +    pcmc->pvh_enabled = false;
>  }
>  
>  DEFINE_PC_MACHINE(xenfv, "xenfv", pc_xen_hvm_init,
> 


Re: [PATCH v3] piix: fix xenfv regression, add compat machine xenfv-qemu4

Posted by Olaf Hering 1 week ago
Am Wed, 25 Mar 2020 16:39:54 +0100
schrieb Paolo Bonzini <pbonzini@redhat.com>:

> hw_compat_3_1 and pc_compat_3_1

I have asked about this earlier, so again:

What do all these arrays do in the context of 'xenfv' to the emulated system?


Olaf

Re: [PATCH v3] piix: fix xenfv regression, add compat machine xenfv-qemu4

Posted by Paolo Bonzini 1 week ago
On 25/03/20 16:45, Olaf Hering wrote:
>> hw_compat_3_1 and pc_compat_3_1
> I have asked about this earlier, so again:
> 
> What do all these arrays do in the context of 'xenfv' to the emulated system?

They change the hardware and CPU features that is presented to the VMs,
if the respective devices are included in the virtual machine.  For
example USB devices will have a different serial number on 3.1 and 5.0,
and VGA devices present EDID information on 4.1+.

Paolo


Re: [PATCH v3] piix: fix xenfv regression, add compat machine xenfv-qemu4

Posted by Olaf Hering 1 week ago
On Wed, Mar 25, Paolo Bonzini wrote:

> On 25/03/20 16:45, Olaf Hering wrote:
> >> hw_compat_3_1 and pc_compat_3_1
> > I have asked about this earlier, so again:
> > What do all these arrays do in the context of 'xenfv' to the emulated system?
> They change the hardware and CPU features that is presented to the VMs,
> if the respective devices are included in the virtual machine.  For
> example USB devices will have a different serial number on 3.1 and 5.0,
> and VGA devices present EDID information on 4.1+.

I will adjust the change to use either pc_i440fx_3_1_machine_options
or pc_i440fx_4_2_machine_options.

Olaf

Re: [PATCH v3] piix: fix xenfv regression, add compat machine xenfv-qemu4

Posted by no-reply@patchew.org 1 week ago
Patchew URL: https://patchew.org/QEMU/20200325064736.22416-1-olaf@aepfle.de/



Hi,

This series failed the asan build test. Please find the testing commands and
their output below. If you have Docker installed, you can probably reproduce it
locally.

=== TEST SCRIPT BEGIN ===
#!/bin/bash
export ARCH=x86_64
make docker-image-fedora V=1 NETWORK=1
time make docker-test-debug@fedora TARGET_LIST=x86_64-softmmu J=14 NETWORK=1
=== TEST SCRIPT END ===

PASS 1 fdc-test /x86_64/fdc/cmos
PASS 2 fdc-test /x86_64/fdc/no_media_on_start
PASS 3 fdc-test /x86_64/fdc/read_without_media
==6172==WARNING: ASan doesn't fully support makecontext/swapcontext functions and may produce false positives in some cases!
PASS 4 fdc-test /x86_64/fdc/media_change
PASS 5 fdc-test /x86_64/fdc/sense_interrupt
PASS 6 fdc-test /x86_64/fdc/relative_seek
---
PASS 32 test-opts-visitor /visitor/opts/range/beyond
PASS 33 test-opts-visitor /visitor/opts/dict/unvisited
MALLOC_PERTURB_=${MALLOC_PERTURB_:-$(( ${RANDOM:-0} % 255 + 1))}  tests/test-coroutine -m=quick -k --tap < /dev/null | ./scripts/tap-driver.pl --test-name="test-coroutine" 
==6223==WARNING: ASan doesn't fully support makecontext/swapcontext functions and may produce false positives in some cases!
==6223==WARNING: ASan is ignoring requested __asan_handle_no_return: stack top: 0x7ffecffca000; bottom 0x7fc4b06ad000; size: 0x003a1f91d000 (249637752832)
False positive error reports may follow
For details see https://github.com/google/sanitizers/issues/189
PASS 1 test-coroutine /basic/no-dangling-access
---
PASS 12 test-aio /aio/event/flush
PASS 13 test-aio /aio/event/wait/no-flush-cb
PASS 14 test-aio /aio/timer/schedule
==6238==WARNING: ASan doesn't fully support makecontext/swapcontext functions and may produce false positives in some cases!
PASS 15 test-aio /aio/coroutine/queue-chaining
PASS 16 test-aio /aio-gsource/flush
PASS 17 test-aio /aio-gsource/bh/schedule
---
PASS 12 fdc-test /x86_64/fdc/read_no_dma_19
PASS 13 fdc-test /x86_64/fdc/fuzz-registers
MALLOC_PERTURB_=${MALLOC_PERTURB_:-$(( ${RANDOM:-0} % 255 + 1))}  QTEST_QEMU_BINARY=x86_64-softmmu/qemu-system-x86_64 QTEST_QEMU_IMG=qemu-img tests/qtest/ide-test -m=quick -k --tap < /dev/null | ./scripts/tap-driver.pl --test-name="ide-test" 
==6246==WARNING: ASan doesn't fully support makecontext/swapcontext functions and may produce false positives in some cases!
PASS 1 ide-test /x86_64/ide/identify
PASS 28 test-aio /aio-gsource/timer/schedule
MALLOC_PERTURB_=${MALLOC_PERTURB_:-$(( ${RANDOM:-0} % 255 + 1))}  tests/test-aio-multithread -m=quick -k --tap < /dev/null | ./scripts/tap-driver.pl --test-name="test-aio-multithread" 
==6252==WARNING: ASan doesn't fully support makecontext/swapcontext functions and may produce false positives in some cases!
==6255==WARNING: ASan doesn't fully support makecontext/swapcontext functions and may produce false positives in some cases!
PASS 1 test-aio-multithread /aio/multi/lifecycle
PASS 2 ide-test /x86_64/ide/flush
==6272==WARNING: ASan doesn't fully support makecontext/swapcontext functions and may produce false positives in some cases!
PASS 3 ide-test /x86_64/ide/bmdma/simple_rw
PASS 2 test-aio-multithread /aio/multi/schedule
==6278==WARNING: ASan doesn't fully support makecontext/swapcontext functions and may produce false positives in some cases!
PASS 4 ide-test /x86_64/ide/bmdma/trim
PASS 3 test-aio-multithread /aio/multi/mutex/contended
==6289==WARNING: ASan doesn't fully support makecontext/swapcontext functions and may produce false positives in some cases!
PASS 4 test-aio-multithread /aio/multi/mutex/handoff
PASS 5 test-aio-multithread /aio/multi/mutex/mcs
PASS 6 test-aio-multithread /aio/multi/mutex/pthread
MALLOC_PERTURB_=${MALLOC_PERTURB_:-$(( ${RANDOM:-0} % 255 + 1))}  tests/test-throttle -m=quick -k --tap < /dev/null | ./scripts/tap-driver.pl --test-name="test-throttle" 
==6313==WARNING: ASan doesn't fully support makecontext/swapcontext functions and may produce false positives in some cases!
PASS 1 test-throttle /throttle/leak_bucket
PASS 2 test-throttle /throttle/compute_wait
PASS 3 test-throttle /throttle/init
---
PASS 14 test-throttle /throttle/config/max
PASS 15 test-throttle /throttle/config/iops_size
MALLOC_PERTURB_=${MALLOC_PERTURB_:-$(( ${RANDOM:-0} % 255 + 1))}  tests/test-thread-pool -m=quick -k --tap < /dev/null | ./scripts/tap-driver.pl --test-name="test-thread-pool" 
==6310==WARNING: ASan doesn't fully support makecontext/swapcontext functions and may produce false positives in some cases!
==6320==WARNING: ASan doesn't fully support makecontext/swapcontext functions and may produce false positives in some cases!
PASS 1 test-thread-pool /thread-pool/submit
PASS 2 test-thread-pool /thread-pool/submit-aio
PASS 3 test-thread-pool /thread-pool/submit-co
---
PASS 14 test-hbitmap /hbitmap/set/twice
PASS 15 test-hbitmap /hbitmap/set/overlap
PASS 16 test-hbitmap /hbitmap/reset/empty
==6392==WARNING: ASan doesn't fully support makecontext/swapcontext functions and may produce false positives in some cases!
PASS 17 test-hbitmap /hbitmap/reset/general
PASS 18 test-hbitmap /hbitmap/reset/all
PASS 19 test-hbitmap /hbitmap/truncate/nop
---
PASS 39 test-hbitmap /hbitmap/next_dirty_area/next_dirty_area_4
PASS 40 test-hbitmap /hbitmap/next_dirty_area/next_dirty_area_after_truncate
MALLOC_PERTURB_=${MALLOC_PERTURB_:-$(( ${RANDOM:-0} % 255 + 1))}  tests/test-bdrv-drain -m=quick -k --tap < /dev/null | ./scripts/tap-driver.pl --test-name="test-bdrv-drain" 
==6399==WARNING: ASan doesn't fully support makecontext/swapcontext functions and may produce false positives in some cases!
PASS 1 test-bdrv-drain /bdrv-drain/nested
PASS 2 test-bdrv-drain /bdrv-drain/multiparent
PASS 3 test-bdrv-drain /bdrv-drain/set_aio_context
---
PASS 41 test-bdrv-drain /bdrv-drain/bdrv_drop_intermediate/poll
PASS 42 test-bdrv-drain /bdrv-drain/replace_child/mid-drain
MALLOC_PERTURB_=${MALLOC_PERTURB_:-$(( ${RANDOM:-0} % 255 + 1))}  tests/test-bdrv-graph-mod -m=quick -k --tap < /dev/null | ./scripts/tap-driver.pl --test-name="test-bdrv-graph-mod" 
==6438==WARNING: ASan doesn't fully support makecontext/swapcontext functions and may produce false positives in some cases!
PASS 1 test-bdrv-graph-mod /bdrv-graph-mod/update-perm-tree
PASS 2 test-bdrv-graph-mod /bdrv-graph-mod/should-update-child
MALLOC_PERTURB_=${MALLOC_PERTURB_:-$(( ${RANDOM:-0} % 255 + 1))}  tests/test-blockjob -m=quick -k --tap < /dev/null | ./scripts/tap-driver.pl --test-name="test-blockjob" 
==6442==WARNING: ASan doesn't fully support makecontext/swapcontext functions and may produce false positives in some cases!
PASS 1 test-blockjob /blockjob/ids
PASS 2 test-blockjob /blockjob/cancel/created
PASS 3 test-blockjob /blockjob/cancel/running
---
PASS 7 test-blockjob /blockjob/cancel/pending
PASS 8 test-blockjob /blockjob/cancel/concluded
MALLOC_PERTURB_=${MALLOC_PERTURB_:-$(( ${RANDOM:-0} % 255 + 1))}  tests/test-blockjob-txn -m=quick -k --tap < /dev/null | ./scripts/tap-driver.pl --test-name="test-blockjob-txn" 
==6446==WARNING: ASan doesn't fully support makecontext/swapcontext functions and may produce false positives in some cases!
PASS 1 test-blockjob-txn /single/success
PASS 2 test-blockjob-txn /single/failure
PASS 3 test-blockjob-txn /single/cancel
---
PASS 6 test-blockjob-txn /pair/cancel
PASS 7 test-blockjob-txn /pair/fail-cancel-race
MALLOC_PERTURB_=${MALLOC_PERTURB_:-$(( ${RANDOM:-0} % 255 + 1))}  tests/test-block-backend -m=quick -k --tap < /dev/null | ./scripts/tap-driver.pl --test-name="test-block-backend" 
==6450==WARNING: ASan doesn't fully support makecontext/swapcontext functions and may produce false positives in some cases!
PASS 1 test-block-backend /block-backend/drain_aio_error
PASS 2 test-block-backend /block-backend/drain_all_aio_error
MALLOC_PERTURB_=${MALLOC_PERTURB_:-$(( ${RANDOM:-0} % 255 + 1))}  tests/test-block-iothread -m=quick -k --tap < /dev/null | ./scripts/tap-driver.pl --test-name="test-block-iothread" 
==6454==WARNING: ASan doesn't fully support makecontext/swapcontext functions and may produce false positives in some cases!
PASS 1 test-block-iothread /sync-op/pread
PASS 2 test-block-iothread /sync-op/pwrite
PASS 3 test-block-iothread /sync-op/load_vmstate
---
PASS 15 test-block-iothread /propagate/diamond
PASS 16 test-block-iothread /propagate/mirror
MALLOC_PERTURB_=${MALLOC_PERTURB_:-$(( ${RANDOM:-0} % 255 + 1))}  tests/test-image-locking -m=quick -k --tap < /dev/null | ./scripts/tap-driver.pl --test-name="test-image-locking" 
==6474==WARNING: ASan doesn't fully support makecontext/swapcontext functions and may produce false positives in some cases!
PASS 1 test-image-locking /image-locking/basic
PASS 2 test-image-locking /image-locking/set-perm-abort
MALLOC_PERTURB_=${MALLOC_PERTURB_:-$(( ${RANDOM:-0} % 255 + 1))}  tests/test-x86-cpuid -m=quick -k --tap < /dev/null | ./scripts/tap-driver.pl --test-name="test-x86-cpuid" 
---
PASS 3 test-xbzrle /xbzrle/encode_decode_unchanged
PASS 4 test-xbzrle /xbzrle/encode_decode_1_byte
PASS 5 test-xbzrle /xbzrle/encode_decode_overflow
==6476==WARNING: ASan doesn't fully support makecontext/swapcontext functions and may produce false positives in some cases!
PASS 6 test-xbzrle /xbzrle/encode_decode
MALLOC_PERTURB_=${MALLOC_PERTURB_:-$(( ${RANDOM:-0} % 255 + 1))}  tests/test-vmstate -m=quick -k --tap < /dev/null | ./scripts/tap-driver.pl --test-name="test-vmstate" 
PASS 1 test-vmstate /vmstate/tmp_struct
---
MALLOC_PERTURB_=${MALLOC_PERTURB_:-$(( ${RANDOM:-0} % 255 + 1))}  tests/test-rcu-list -m=quick -k --tap < /dev/null | ./scripts/tap-driver.pl --test-name="test-rcu-list" 
PASS 1 test-rcu-list /rcu/qlist/single-threaded
PASS 2 test-rcu-list /rcu/qlist/short-few
==6544==WARNING: ASan doesn't fully support makecontext/swapcontext functions and may produce false positives in some cases!
PASS 3 test-rcu-list /rcu/qlist/long-many
MALLOC_PERTURB_=${MALLOC_PERTURB_:-$(( ${RANDOM:-0} % 255 + 1))}  tests/test-rcu-simpleq -m=quick -k --tap < /dev/null | ./scripts/tap-driver.pl --test-name="test-rcu-simpleq" 
PASS 1 test-rcu-simpleq /rcu/qsimpleq/single-threaded
PASS 2 test-rcu-simpleq /rcu/qsimpleq/short-few
PASS 3 test-rcu-simpleq /rcu/qsimpleq/long-many
MALLOC_PERTURB_=${MALLOC_PERTURB_:-$(( ${RANDOM:-0} % 255 + 1))}  tests/test-rcu-tailq -m=quick -k --tap < /dev/null | ./scripts/tap-driver.pl --test-name="test-rcu-tailq" 
==6604==WARNING: ASan doesn't fully support makecontext/swapcontext functions and may produce false positives in some cases!
PASS 1 test-rcu-tailq /rcu/qtailq/single-threaded
PASS 2 test-rcu-tailq /rcu/qtailq/short-few
PASS 3 test-rcu-tailq /rcu/qtailq/long-many
MALLOC_PERTURB_=${MALLOC_PERTURB_:-$(( ${RANDOM:-0} % 255 + 1))}  tests/test-rcu-slist -m=quick -k --tap < /dev/null | ./scripts/tap-driver.pl --test-name="test-rcu-slist" 
PASS 1 test-rcu-slist /rcu/qslist/single-threaded
PASS 2 test-rcu-slist /rcu/qslist/short-few
==6655==WARNING: ASan doesn't fully support makecontext/swapcontext functions and may produce false positives in some cases!
PASS 3 test-rcu-slist /rcu/qslist/long-many
MALLOC_PERTURB_=${MALLOC_PERTURB_:-$(( ${RANDOM:-0} % 255 + 1))}  tests/test-qdist -m=quick -k --tap < /dev/null | ./scripts/tap-driver.pl --test-name="test-qdist" 
PASS 1 test-qdist /qdist/none
---
PASS 7 test-qdist /qdist/binning/expand
PASS 8 test-qdist /qdist/binning/shrink
MALLOC_PERTURB_=${MALLOC_PERTURB_:-$(( ${RANDOM:-0} % 255 + 1))}  tests/test-qht -m=quick -k --tap < /dev/null | ./scripts/tap-driver.pl --test-name="test-qht" 
==6689==WARNING: ASan doesn't fully support makecontext/swapcontext functions and may produce false positives in some cases!
==6695==WARNING: ASan doesn't fully support makecontext/swapcontext functions and may produce false positives in some cases!
PASS 1 test-qht /qht/mode/default
PASS 2 test-qht /qht/mode/resize
MALLOC_PERTURB_=${MALLOC_PERTURB_:-$(( ${RANDOM:-0} % 255 + 1))}  tests/test-qht-par -m=quick -k --tap < /dev/null | ./scripts/tap-driver.pl --test-name="test-qht-par" 
PASS 5 ide-test /x86_64/ide/bmdma/various_prdts
==6710==WARNING: ASan doesn't fully support makecontext/swapcontext functions and may produce false positives in some cases!
==6710==WARNING: ASan is ignoring requested __asan_handle_no_return: stack top: 0x7ffec1fae000; bottom 0x7f589c766000; size: 0x00a625848000 (713594011648)
False positive error reports may follow
For details see https://github.com/google/sanitizers/issues/189
PASS 1 test-qht-par /qht/parallel/2threads-0%updates-1s
---
PASS 5 test-bitops /bitops/half_unshuffle32
PASS 6 test-bitops /bitops/half_unshuffle64
MALLOC_PERTURB_=${MALLOC_PERTURB_:-$(( ${RANDOM:-0} % 255 + 1))}  tests/test-bitcnt -m=quick -k --tap < /dev/null | ./scripts/tap-driver.pl --test-name="test-bitcnt" 
==6727==WARNING: ASan doesn't fully support makecontext/swapcontext functions and may produce false positives in some cases!
PASS 8 ide-test /x86_64/ide/flush/empty_drive
PASS 1 test-bitcnt /bitcnt/ctpop8
PASS 2 test-bitcnt /bitcnt/ctpop16
---
PASS 1 check-qom-interface /qom/interface/direct_impl
PASS 2 check-qom-interface /qom/interface/intermediate_impl
MALLOC_PERTURB_=${MALLOC_PERTURB_:-$(( ${RANDOM:-0} % 255 + 1))}  tests/check-qom-proplist -m=quick -k --tap < /dev/null | ./scripts/tap-driver.pl --test-name="check-qom-proplist" 
==6738==WARNING: ASan doesn't fully support makecontext/swapcontext functions and may produce false positives in some cases!
PASS 1 check-qom-proplist /qom/proplist/createlist
PASS 2 check-qom-proplist /qom/proplist/createv
PASS 3 check-qom-proplist /qom/proplist/createcmdline
---
MALLOC_PERTURB_=${MALLOC_PERTURB_:-$(( ${RANDOM:-0} % 255 + 1))}  tests/test-keyval -m=quick -k --tap < /dev/null | ./scripts/tap-driver.pl --test-name="test-keyval" 
PASS 1 test-keyval /keyval/keyval_parse
PASS 2 test-keyval /keyval/keyval_parse/list
==6770==WARNING: ASan doesn't fully support makecontext/swapcontext functions and may produce false positives in some cases!
PASS 3 test-keyval /keyval/visit/bool
PASS 4 test-keyval /keyval/visit/number
PASS 5 test-keyval /keyval/visit/size
---
PASS 15 test-crypto-secret /crypto/secret/crypt/missingiv
PASS 16 test-crypto-secret /crypto/secret/crypt/badiv
MALLOC_PERTURB_=${MALLOC_PERTURB_:-$(( ${RANDOM:-0} % 255 + 1))}  tests/test-crypto-tlscredsx509 -m=quick -k --tap < /dev/null | ./scripts/tap-driver.pl --test-name="test-crypto-tlscredsx509" 
==6787==WARNING: ASan doesn't fully support makecontext/swapcontext functions and may produce false positives in some cases!
PASS 11 ide-test /x86_64/ide/cdrom/pio
==6810==WARNING: ASan doesn't fully support makecontext/swapcontext functions and may produce false positives in some cases!
PASS 1 test-crypto-tlscredsx509 /qcrypto/tlscredsx509/perfectserver
PASS 2 test-crypto-tlscredsx509 /qcrypto/tlscredsx509/perfectclient
PASS 12 ide-test /x86_64/ide/cdrom/pio_large
---
PASS 6 test-crypto-tlscredsx509 /qcrypto/tlscredsx509/badca1
PASS 7 test-crypto-tlscredsx509 /qcrypto/tlscredsx509/badca2
PASS 8 test-crypto-tlscredsx509 /qcrypto/tlscredsx509/badca3
==6816==WARNING: ASan doesn't fully support makecontext/swapcontext functions and may produce false positives in some cases!
PASS 13 ide-test /x86_64/ide/cdrom/dma
PASS 9 test-crypto-tlscredsx509 /qcrypto/tlscredsx509/goodserver1
MALLOC_PERTURB_=${MALLOC_PERTURB_:-$(( ${RANDOM:-0} % 255 + 1))}  QTEST_QEMU_BINARY=x86_64-softmmu/qemu-system-x86_64 QTEST_QEMU_IMG=qemu-img tests/qtest/ahci-test -m=quick -k --tap < /dev/null | ./scripts/tap-driver.pl --test-name="ahci-test" 
PASS 10 test-crypto-tlscredsx509 /qcrypto/tlscredsx509/goodserver2
PASS 11 test-crypto-tlscredsx509 /qcrypto/tlscredsx509/goodserver3
PASS 12 test-crypto-tlscredsx509 /qcrypto/tlscredsx509/goodserver4
==6830==WARNING: ASan doesn't fully support makecontext/swapcontext functions and may produce false positives in some cases!
PASS 1 ahci-test /x86_64/ahci/sanity
==6836==WARNING: ASan doesn't fully support makecontext/swapcontext functions and may produce false positives in some cases!
PASS 2 ahci-test /x86_64/ahci/pci_spec
==6842==WARNING: ASan doesn't fully support makecontext/swapcontext functions and may produce false positives in some cases!
PASS 3 ahci-test /x86_64/ahci/pci_enable
==6848==WARNING: ASan doesn't fully support makecontext/swapcontext functions and may produce false positives in some cases!
PASS 13 test-crypto-tlscredsx509 /qcrypto/tlscredsx509/goodserver5
PASS 4 ahci-test /x86_64/ahci/hba_spec
PASS 14 test-crypto-tlscredsx509 /qcrypto/tlscredsx509/goodserver6
==6854==WARNING: ASan doesn't fully support makecontext/swapcontext functions and may produce false positives in some cases!
PASS 5 ahci-test /x86_64/ahci/hba_enable
PASS 15 test-crypto-tlscredsx509 /qcrypto/tlscredsx509/goodserver7
PASS 16 test-crypto-tlscredsx509 /qcrypto/tlscredsx509/badserver1
---
PASS 32 test-crypto-tlscredsx509 /qcrypto/tlscredsx509/inactive1
PASS 33 test-crypto-tlscredsx509 /qcrypto/tlscredsx509/inactive2
PASS 34 test-crypto-tlscredsx509 /qcrypto/tlscredsx509/inactive3
==6860==WARNING: ASan doesn't fully support makecontext/swapcontext functions and may produce false positives in some cases!
PASS 6 ahci-test /x86_64/ahci/identify
==6866==WARNING: ASan doesn't fully support makecontext/swapcontext functions and may produce false positives in some cases!
PASS 35 test-crypto-tlscredsx509 /qcrypto/tlscredsx509/chain1
PASS 36 test-crypto-tlscredsx509 /qcrypto/tlscredsx509/chain2
PASS 37 test-crypto-tlscredsx509 /qcrypto/tlscredsx509/missingca
---
PASS 39 test-crypto-tlscredsx509 /qcrypto/tlscredsx509/missingclient
MALLOC_PERTURB_=${MALLOC_PERTURB_:-$(( ${RANDOM:-0} % 255 + 1))}  tests/test-crypto-tlssession -m=quick -k --tap < /dev/null | ./scripts/tap-driver.pl --test-name="test-crypto-tlssession" 
PASS 7 ahci-test /x86_64/ahci/max
==6876==WARNING: ASan doesn't fully support makecontext/swapcontext functions and may produce false positives in some cases!
PASS 1 test-crypto-tlssession /qcrypto/tlssession/psk
PASS 2 test-crypto-tlssession /qcrypto/tlssession/basicca
PASS 3 test-crypto-tlssession /qcrypto/tlssession/differentca
PASS 8 ahci-test /x86_64/ahci/reset
==6882==WARNING: ASan doesn't fully support makecontext/swapcontext functions and may produce false positives in some cases!
PASS 4 test-crypto-tlssession /qcrypto/tlssession/altname1
==6882==WARNING: ASan is ignoring requested __asan_handle_no_return: stack top: 0x7fff87e1b000; bottom 0x7ff6b03fe000; size: 0x0008d7a1d000 (37977444352)
False positive error reports may follow
For details see https://github.com/google/sanitizers/issues/189
PASS 9 ahci-test /x86_64/ahci/io/pio/lba28/simple/zero
PASS 5 test-crypto-tlssession /qcrypto/tlssession/altname2
PASS 6 test-crypto-tlssession /qcrypto/tlssession/altname3
==6888==WARNING: ASan doesn't fully support makecontext/swapcontext functions and may produce false positives in some cases!
==6888==WARNING: ASan is ignoring requested __asan_handle_no_return: stack top: 0x7ffc5f5a2000; bottom 0x7f2da0bfe000; size: 0x00cebe9a4000 (887961042944)
False positive error reports may follow
For details see https://github.com/google/sanitizers/issues/189
PASS 7 test-crypto-tlssession /qcrypto/tlssession/altname4
PASS 10 ahci-test /x86_64/ahci/io/pio/lba28/simple/low
PASS 8 test-crypto-tlssession /qcrypto/tlssession/altname5
==6894==WARNING: ASan doesn't fully support makecontext/swapcontext functions and may produce false positives in some cases!
==6894==WARNING: ASan is ignoring requested __asan_handle_no_return: stack top: 0x7ffcc4a0d000; bottom 0x7f5736bfe000; size: 0x00a58de0f000 (711049932800)
False positive error reports may follow
For details see https://github.com/google/sanitizers/issues/189
PASS 9 test-crypto-tlssession /qcrypto/tlssession/altname6
PASS 11 ahci-test /x86_64/ahci/io/pio/lba28/simple/high
PASS 10 test-crypto-tlssession /qcrypto/tlssession/wildcard1
==6900==WARNING: ASan doesn't fully support makecontext/swapcontext functions and may produce false positives in some cases!
==6900==WARNING: ASan is ignoring requested __asan_handle_no_return: stack top: 0x7ffc48546000; bottom 0x7f746bdfe000; size: 0x0087dc748000 (583519207424)
False positive error reports may follow
For details see https://github.com/google/sanitizers/issues/189
PASS 12 ahci-test /x86_64/ahci/io/pio/lba28/double/zero
PASS 11 test-crypto-tlssession /qcrypto/tlssession/wildcard2
PASS 12 test-crypto-tlssession /qcrypto/tlssession/wildcard3
==6906==WARNING: ASan doesn't fully support makecontext/swapcontext functions and may produce false positives in some cases!
==6906==WARNING: ASan is ignoring requested __asan_handle_no_return: stack top: 0x7ffc8d3ce000; bottom 0x7f561affe000; size: 0x00a6723d0000 (714881171456)
False positive error reports may follow
For details see https://github.com/google/sanitizers/issues/189
PASS 13 ahci-test /x86_64/ahci/io/pio/lba28/double/low
==6912==WARNING: ASan doesn't fully support makecontext/swapcontext functions and may produce false positives in some cases!
==6912==WARNING: ASan is ignoring requested __asan_handle_no_return: stack top: 0x7ffd13476000; bottom 0x7fdc5bbfe000; size: 0x0020b7878000 (140518064128)
False positive error reports may follow
For details see https://github.com/google/sanitizers/issues/189
PASS 14 ahci-test /x86_64/ahci/io/pio/lba28/double/high
PASS 13 test-crypto-tlssession /qcrypto/tlssession/wildcard4
PASS 14 test-crypto-tlssession /qcrypto/tlssession/wildcard5
==6918==WARNING: ASan doesn't fully support makecontext/swapcontext functions and may produce false positives in some cases!
PASS 15 test-crypto-tlssession /qcrypto/tlssession/wildcard6
==6918==WARNING: ASan is ignoring requested __asan_handle_no_return: stack top: 0x7ffec8956000; bottom 0x7f07ed77c000; size: 0x00f6db1da000 (1060238106624)
False positive error reports may follow
For details see https://github.com/google/sanitizers/issues/189
PASS 16 test-crypto-tlssession /qcrypto/tlssession/cachain
MALLOC_PERTURB_=${MALLOC_PERTURB_:-$(( ${RANDOM:-0} % 255 + 1))}  tests/test-qga -m=quick -k --tap < /dev/null | ./scripts/tap-driver.pl --test-name="test-qga" 
PASS 15 ahci-test /x86_64/ahci/io/pio/lba28/long/zero
==6932==WARNING: ASan doesn't fully support makecontext/swapcontext functions and may produce false positives in some cases!
==6932==WARNING: ASan is ignoring requested __asan_handle_no_return: stack top: 0x7fff2a04f000; bottom 0x7f938a37c000; size: 0x006b9fcd3000 (462242525184)
False positive error reports may follow
For details see https://github.com/google/sanitizers/issues/189
PASS 1 test-qga /qga/sync-delimited
---
PASS 15 test-qga /qga/invalid-cmd
PASS 16 test-qga /qga/invalid-args
PASS 17 test-qga /qga/fsfreeze-status
==6938==WARNING: ASan doesn't fully support makecontext/swapcontext functions and may produce false positives in some cases!
==6938==WARNING: ASan is ignoring requested __asan_handle_no_return: stack top: 0x7ffcc7157000; bottom 0x7efc3a124000; size: 0x01008d033000 (1101877424128)
False positive error reports may follow
For details see https://github.com/google/sanitizers/issues/189
PASS 18 test-qga /qga/blacklist
---
PASS 20 test-qga /qga/guest-exec
PASS 21 test-qga /qga/guest-exec-invalid
PASS 17 ahci-test /x86_64/ahci/io/pio/lba28/long/high
==6959==WARNING: ASan doesn't fully support makecontext/swapcontext functions and may produce false positives in some cases!
PASS 18 ahci-test /x86_64/ahci/io/pio/lba28/short/zero
PASS 22 test-qga /qga/guest-get-osinfo
PASS 23 test-qga /qga/guest-get-host-name
PASS 24 test-qga /qga/guest-get-timezone
PASS 25 test-qga /qga/guest-get-users
MALLOC_PERTURB_=${MALLOC_PERTURB_:-$(( ${RANDOM:-0} % 255 + 1))}  tests/test-timed-average -m=quick -k --tap < /dev/null | ./scripts/tap-driver.pl --test-name="test-timed-average" 
==6965==WARNING: ASan doesn't fully support makecontext/swapcontext functions and may produce false positives in some cases!
PASS 1 test-timed-average /timed-average/average
MALLOC_PERTURB_=${MALLOC_PERTURB_:-$(( ${RANDOM:-0} % 255 + 1))}  tests/test-util-filemonitor -m=quick -k --tap < /dev/null | ./scripts/tap-driver.pl --test-name="test-util-filemonitor" 
PASS 1 test-util-filemonitor /util/filemonitor
---
PASS 5 test-authz-list /auth/list/explicit/deny
PASS 6 test-authz-list /auth/list/explicit/allow
MALLOC_PERTURB_=${MALLOC_PERTURB_:-$(( ${RANDOM:-0} % 255 + 1))}  tests/test-authz-listfile -m=quick -k --tap < /dev/null | ./scripts/tap-driver.pl --test-name="test-authz-listfile" 
==6985==WARNING: ASan doesn't fully support makecontext/swapcontext functions and may produce false positives in some cases!
PASS 1 test-authz-listfile /auth/list/complex
PASS 2 test-authz-listfile /auth/list/default/deny
PASS 3 test-authz-listfile /auth/list/default/allow
---
PASS 4 test-io-channel-file /io/channel/pipe/sync
PASS 5 test-io-channel-file /io/channel/pipe/async
MALLOC_PERTURB_=${MALLOC_PERTURB_:-$(( ${RANDOM:-0} % 255 + 1))}  tests/test-io-channel-tls -m=quick -k --tap < /dev/null | ./scripts/tap-driver.pl --test-name="test-io-channel-tls" 
==7009==WARNING: ASan doesn't fully support makecontext/swapcontext functions and may produce false positives in some cases!
==7009==WARNING: ASan is ignoring requested __asan_handle_no_return: stack top: 0x7fff21df2000; bottom 0x7f7e9fbfe000; size: 0x0080821f4000 (551938899968)
False positive error reports may follow
For details see https://github.com/google/sanitizers/issues/189
PASS 21 ahci-test /x86_64/ahci/io/pio/lba48/simple/zero
---
PASS 3 test-io-channel-command /io/channel/command/echo/sync
PASS 4 test-io-channel-command /io/channel/command/echo/async
MALLOC_PERTURB_=${MALLOC_PERTURB_:-$(( ${RANDOM:-0} % 255 + 1))}  tests/test-io-channel-buffer -m=quick -k --tap < /dev/null | ./scripts/tap-driver.pl --test-name="test-io-channel-buffer" 
==7071==WARNING: ASan doesn't fully support makecontext/swapcontext functions and may produce false positives in some cases!
PASS 1 test-io-channel-buffer /io/channel/buf
MALLOC_PERTURB_=${MALLOC_PERTURB_:-$(( ${RANDOM:-0} % 255 + 1))}  tests/test-base64 -m=quick -k --tap < /dev/null | ./scripts/tap-driver.pl --test-name="test-base64" 
==7071==WARNING: ASan is ignoring requested __asan_handle_no_return: stack top: 0x7fff1c667000; bottom 0x7f791b3fe000; size: 0x008601269000 (575544922112)
False positive error reports may follow
For details see https://github.com/google/sanitizers/issues/189
PASS 1 test-base64 /util/base64/good
---
PASS 3 test-logging /logging/logfile_write_path
PASS 4 test-logging /logging/logfile_lock_path
MALLOC_PERTURB_=${MALLOC_PERTURB_:-$(( ${RANDOM:-0} % 255 + 1))}  tests/test-replication -m=quick -k --tap < /dev/null | ./scripts/tap-driver.pl --test-name="test-replication" 
==7115==WARNING: ASan doesn't fully support makecontext/swapcontext functions and may produce false positives in some cases!
==7111==WARNING: ASan doesn't fully support makecontext/swapcontext functions and may produce false positives in some cases!
==7111==WARNING: ASan is ignoring requested __asan_handle_no_return: stack top: 0x7ffd270c6000; bottom 0x7fb473bfe000; size: 0x0048b34c8000 (312245780480)
False positive error reports may follow
For details see https://github.com/google/sanitizers/issues/189
PASS 23 ahci-test /x86_64/ahci/io/pio/lba48/simple/high
PASS 1 test-replication /replication/primary/read
PASS 2 test-replication /replication/primary/write
==7123==WARNING: ASan doesn't fully support makecontext/swapcontext functions and may produce false positives in some cases!
==7123==WARNING: ASan is ignoring requested __asan_handle_no_return: stack top: 0x7ffd3a8a0000; bottom 0x7fedd0ffe000; size: 0x000f698a2000 (66195169280)
False positive error reports may follow
For details see https://github.com/google/sanitizers/issues/189
PASS 24 ahci-test /x86_64/ahci/io/pio/lba48/double/zero
---
PASS 4 test-replication /replication/primary/stop
PASS 5 test-replication /replication/primary/do_checkpoint
PASS 6 test-replication /replication/primary/get_error_all
==7129==WARNING: ASan doesn't fully support makecontext/swapcontext functions and may produce false positives in some cases!
==7129==WARNING: ASan is ignoring requested __asan_handle_no_return: stack top: 0x7ffd333c3000; bottom 0x7f9b9a3fe000; size: 0x006198fc5000 (419178500096)
False positive error reports may follow
For details see https://github.com/google/sanitizers/issues/189
PASS 25 ahci-test /x86_64/ahci/io/pio/lba48/double/low
PASS 7 test-replication /replication/secondary/read
==7135==WARNING: ASan doesn't fully support makecontext/swapcontext functions and may produce false positives in some cases!
==7135==WARNING: ASan is ignoring requested __asan_handle_no_return: stack top: 0x7ffdf830f000; bottom 0x7f664b1fe000; size: 0x0097ad111000 (651443638272)
False positive error reports may follow
For details see https://github.com/google/sanitizers/issues/189
PASS 8 test-replication /replication/secondary/write
PASS 26 ahci-test /x86_64/ahci/io/pio/lba48/double/high
==7141==WARNING: ASan doesn't fully support makecontext/swapcontext functions and may produce false positives in some cases!
==7141==WARNING: ASan is ignoring requested __asan_handle_no_return: stack top: 0x7ffddd57d000; bottom 0x7fc1f9ffe000; size: 0x003be357f000 (257217261568)
False positive error reports may follow
For details see https://github.com/google/sanitizers/issues/189
PASS 27 ahci-test /x86_64/ahci/io/pio/lba48/long/zero
==7147==WARNING: ASan doesn't fully support makecontext/swapcontext functions and may produce false positives in some cases!
==7147==WARNING: ASan is ignoring requested __asan_handle_no_return: stack top: 0x7fffbcfe9000; bottom 0x7f2c401fe000; size: 0x00d37cdeb000 (908333068288)
False positive error reports may follow
For details see https://github.com/google/sanitizers/issues/189
==7115==WARNING: ASan is ignoring requested __asan_handle_no_return: stack top: 0x7ffe5a607000; bottom 0x7f5310e69000; size: 0x00ab4979e000 (735672131584)
False positive error reports may follow
For details see https://github.com/google/sanitizers/issues/189
PASS 28 ahci-test /x86_64/ahci/io/pio/lba48/long/low
PASS 9 test-replication /replication/secondary/start
==7172==WARNING: ASan doesn't fully support makecontext/swapcontext functions and may produce false positives in some cases!
==7172==WARNING: ASan is ignoring requested __asan_handle_no_return: stack top: 0x7ffd6ba70000; bottom 0x7f011a3fe000; size: 0x00fc51672000 (1083697471488)
False positive error reports may follow
For details see https://github.com/google/sanitizers/issues/189
PASS 29 ahci-test /x86_64/ahci/io/pio/lba48/long/high
==7178==WARNING: ASan doesn't fully support makecontext/swapcontext functions and may produce false positives in some cases!
PASS 30 ahci-test /x86_64/ahci/io/pio/lba48/short/zero
==7184==WARNING: ASan doesn't fully support makecontext/swapcontext functions and may produce false positives in some cases!
PASS 31 ahci-test /x86_64/ahci/io/pio/lba48/short/low
==7190==WARNING: ASan doesn't fully support makecontext/swapcontext functions and may produce false positives in some cases!
PASS 32 ahci-test /x86_64/ahci/io/pio/lba48/short/high
PASS 10 test-replication /replication/secondary/stop
==7196==WARNING: ASan doesn't fully support makecontext/swapcontext functions and may produce false positives in some cases!
PASS 33 ahci-test /x86_64/ahci/io/dma/lba28/fragmented
==7202==WARNING: ASan doesn't fully support makecontext/swapcontext functions and may produce false positives in some cases!
PASS 34 ahci-test /x86_64/ahci/io/dma/lba28/retry
==7208==WARNING: ASan doesn't fully support makecontext/swapcontext functions and may produce false positives in some cases!
PASS 35 ahci-test /x86_64/ahci/io/dma/lba28/simple/zero
PASS 11 test-replication /replication/secondary/continuous_replication
==7214==WARNING: ASan doesn't fully support makecontext/swapcontext functions and may produce false positives in some cases!
PASS 36 ahci-test /x86_64/ahci/io/dma/lba28/simple/low
==7220==WARNING: ASan doesn't fully support makecontext/swapcontext functions and may produce false positives in some cases!
PASS 37 ahci-test /x86_64/ahci/io/dma/lba28/simple/high
==7226==WARNING: ASan doesn't fully support makecontext/swapcontext functions and may produce false positives in some cases!
PASS 12 test-replication /replication/secondary/do_checkpoint
PASS 38 ahci-test /x86_64/ahci/io/dma/lba28/double/zero
==7232==WARNING: ASan doesn't fully support makecontext/swapcontext functions and may produce false positives in some cases!
PASS 13 test-replication /replication/secondary/get_error_all
PASS 39 ahci-test /x86_64/ahci/io/dma/lba28/double/low
MALLOC_PERTURB_=${MALLOC_PERTURB_:-$(( ${RANDOM:-0} % 255 + 1))}  tests/test-bufferiszero -m=quick -k --tap < /dev/null | ./scripts/tap-driver.pl --test-name="test-bufferiszero" 
==7238==WARNING: ASan doesn't fully support makecontext/swapcontext functions and may produce false positives in some cases!
PASS 40 ahci-test /x86_64/ahci/io/dma/lba28/double/high
==7247==WARNING: ASan doesn't fully support makecontext/swapcontext functions and may produce false positives in some cases!
==7247==WARNING: ASan is ignoring requested __asan_handle_no_return: stack top: 0x7ffc45097000; bottom 0x7f38825fd000; size: 0x00c3c2a9a000 (840784519168)
False positive error reports may follow
For details see https://github.com/google/sanitizers/issues/189
PASS 41 ahci-test /x86_64/ahci/io/dma/lba28/long/zero
==7254==WARNING: ASan doesn't fully support makecontext/swapcontext functions and may produce false positives in some cases!
==7254==WARNING: ASan is ignoring requested __asan_handle_no_return: stack top: 0x7ffd13aee000; bottom 0x7f4bfcffd000; size: 0x00b116af1000 (760589783040)
False positive error reports may follow
For details see https://github.com/google/sanitizers/issues/189
PASS 42 ahci-test /x86_64/ahci/io/dma/lba28/long/low
==7261==WARNING: ASan doesn't fully support makecontext/swapcontext functions and may produce false positives in some cases!
==7261==WARNING: ASan is ignoring requested __asan_handle_no_return: stack top: 0x7ffe7c627000; bottom 0x7faf7c5fd000; size: 0x004f0002a000 (339302588416)
False positive error reports may follow
For details see https://github.com/google/sanitizers/issues/189
PASS 43 ahci-test /x86_64/ahci/io/dma/lba28/long/high
==7268==WARNING: ASan doesn't fully support makecontext/swapcontext functions and may produce false positives in some cases!
PASS 44 ahci-test /x86_64/ahci/io/dma/lba28/short/zero
==7274==WARNING: ASan doesn't fully support makecontext/swapcontext functions and may produce false positives in some cases!
PASS 45 ahci-test /x86_64/ahci/io/dma/lba28/short/low
==7280==WARNING: ASan doesn't fully support makecontext/swapcontext functions and may produce false positives in some cases!
PASS 46 ahci-test /x86_64/ahci/io/dma/lba28/short/high
==7286==WARNING: ASan doesn't fully support makecontext/swapcontext functions and may produce false positives in some cases!
PASS 47 ahci-test /x86_64/ahci/io/dma/lba48/simple/zero
==7292==WARNING: ASan doesn't fully support makecontext/swapcontext functions and may produce false positives in some cases!
PASS 48 ahci-test /x86_64/ahci/io/dma/lba48/simple/low
==7298==WARNING: ASan doesn't fully support makecontext/swapcontext functions and may produce false positives in some cases!
PASS 49 ahci-test /x86_64/ahci/io/dma/lba48/simple/high
==7304==WARNING: ASan doesn't fully support makecontext/swapcontext functions and may produce false positives in some cases!
PASS 50 ahci-test /x86_64/ahci/io/dma/lba48/double/zero
==7310==WARNING: ASan doesn't fully support makecontext/swapcontext functions and may produce false positives in some cases!
PASS 51 ahci-test /x86_64/ahci/io/dma/lba48/double/low
==7316==WARNING: ASan doesn't fully support makecontext/swapcontext functions and may produce false positives in some cases!
PASS 52 ahci-test /x86_64/ahci/io/dma/lba48/double/high
==7322==WARNING: ASan doesn't fully support makecontext/swapcontext functions and may produce false positives in some cases!
==7322==WARNING: ASan is ignoring requested __asan_handle_no_return: stack top: 0x7fff65665000; bottom 0x7f35e09fd000; size: 0x00c984c68000 (865516027904)
False positive error reports may follow
For details see https://github.com/google/sanitizers/issues/189
PASS 53 ahci-test /x86_64/ahci/io/dma/lba48/long/zero
==7329==WARNING: ASan doesn't fully support makecontext/swapcontext functions and may produce false positives in some cases!
==7329==WARNING: ASan is ignoring requested __asan_handle_no_return: stack top: 0x7ffc1ada4000; bottom 0x7f5dcedfd000; size: 0x009e4bfa7000 (679879536640)
False positive error reports may follow
For details see https://github.com/google/sanitizers/issues/189
PASS 54 ahci-test /x86_64/ahci/io/dma/lba48/long/low
==7336==WARNING: ASan doesn't fully support makecontext/swapcontext functions and may produce false positives in some cases!
==7336==WARNING: ASan is ignoring requested __asan_handle_no_return: stack top: 0x7ffdcd211000; bottom 0x7f7a96ffd000; size: 0x008336214000 (563548864512)
False positive error reports may follow
For details see https://github.com/google/sanitizers/issues/189
PASS 55 ahci-test /x86_64/ahci/io/dma/lba48/long/high
==7343==WARNING: ASan doesn't fully support makecontext/swapcontext functions and may produce false positives in some cases!
PASS 56 ahci-test /x86_64/ahci/io/dma/lba48/short/zero
==7349==WARNING: ASan doesn't fully support makecontext/swapcontext functions and may produce false positives in some cases!
PASS 57 ahci-test /x86_64/ahci/io/dma/lba48/short/low
==7355==WARNING: ASan doesn't fully support makecontext/swapcontext functions and may produce false positives in some cases!
PASS 58 ahci-test /x86_64/ahci/io/dma/lba48/short/high
==7361==WARNING: ASan doesn't fully support makecontext/swapcontext functions and may produce false positives in some cases!
PASS 59 ahci-test /x86_64/ahci/io/ncq/simple
==7367==WARNING: ASan doesn't fully support makecontext/swapcontext functions and may produce false positives in some cases!
PASS 60 ahci-test /x86_64/ahci/io/ncq/retry
==7373==WARNING: ASan doesn't fully support makecontext/swapcontext functions and may produce false positives in some cases!
PASS 61 ahci-test /x86_64/ahci/flush/simple
==7379==WARNING: ASan doesn't fully support makecontext/swapcontext functions and may produce false positives in some cases!
PASS 62 ahci-test /x86_64/ahci/flush/retry
==7385==WARNING: ASan doesn't fully support makecontext/swapcontext functions and may produce false positives in some cases!
==7391==WARNING: ASan doesn't fully support makecontext/swapcontext functions and may produce false positives in some cases!
PASS 63 ahci-test /x86_64/ahci/flush/migrate
==7399==WARNING: ASan doesn't fully support makecontext/swapcontext functions and may produce false positives in some cases!
==7405==WARNING: ASan doesn't fully support makecontext/swapcontext functions and may produce false positives in some cases!
PASS 64 ahci-test /x86_64/ahci/migrate/sanity
==7413==WARNING: ASan doesn't fully support makecontext/swapcontext functions and may produce false positives in some cases!
==7419==WARNING: ASan doesn't fully support makecontext/swapcontext functions and may produce false positives in some cases!
PASS 65 ahci-test /x86_64/ahci/migrate/dma/simple
PASS 1 test-bufferiszero /cutils/bufferiszero
MALLOC_PERTURB_=${MALLOC_PERTURB_:-$(( ${RANDOM:-0} % 255 + 1))}  tests/test-uuid -m=quick -k --tap < /dev/null | ./scripts/tap-driver.pl --test-name="test-uuid" 
---
PASS 4 test-uuid /uuid/unparse
PASS 5 test-uuid /uuid/unparse_strdup
MALLOC_PERTURB_=${MALLOC_PERTURB_:-$(( ${RANDOM:-0} % 255 + 1))}  tests/ptimer-test -m=quick -k --tap < /dev/null | ./scripts/tap-driver.pl --test-name="ptimer-test" 
==7427==WARNING: ASan doesn't fully support makecontext/swapcontext functions and may produce false positives in some cases!
PASS 1 ptimer-test /ptimer/set_count policy=default
PASS 2 ptimer-test /ptimer/set_limit policy=default
PASS 3 ptimer-test /ptimer/oneshot policy=default
---
PASS 21 test-qgraph /qgraph/test_two_test_same_interface
PASS 22 test-qgraph /qgraph/test_test_in_path
PASS 23 test-qgraph /qgraph/test_double_edge
==7443==WARNING: ASan doesn't fully support makecontext/swapcontext functions and may produce false positives in some cases!
PASS 66 ahci-test /x86_64/ahci/migrate/dma/halted
==7454==WARNING: ASan doesn't fully support makecontext/swapcontext functions and may produce false positives in some cases!
==7460==WARNING: ASan doesn't fully support makecontext/swapcontext functions and may produce false positives in some cases!
PASS 67 ahci-test /x86_64/ahci/migrate/ncq/simple
==7468==WARNING: ASan doesn't fully support makecontext/swapcontext functions and may produce false positives in some cases!
==7474==WARNING: ASan doesn't fully support makecontext/swapcontext functions and may produce false positives in some cases!
PASS 68 ahci-test /x86_64/ahci/migrate/ncq/halted
==7482==WARNING: ASan doesn't fully support makecontext/swapcontext functions and may produce false positives in some cases!
PASS 69 ahci-test /x86_64/ahci/cdrom/eject
==7487==WARNING: ASan doesn't fully support makecontext/swapcontext functions and may produce false positives in some cases!
PASS 70 ahci-test /x86_64/ahci/cdrom/dma/single
==7493==WARNING: ASan doesn't fully support makecontext/swapcontext functions and may produce false positives in some cases!
PASS 71 ahci-test /x86_64/ahci/cdrom/dma/multi
==7499==WARNING: ASan doesn't fully support makecontext/swapcontext functions and may produce false positives in some cases!
PASS 72 ahci-test /x86_64/ahci/cdrom/pio/single
==7505==WARNING: ASan doesn't fully support makecontext/swapcontext functions and may produce false positives in some cases!
==7505==WARNING: ASan is ignoring requested __asan_handle_no_return: stack top: 0x7fff7836c000; bottom 0x7fbc325fe000; size: 0x004345d6e000 (288934518784)
False positive error reports may follow
For details see https://github.com/google/sanitizers/issues/189
PASS 73 ahci-test /x86_64/ahci/cdrom/pio/multi
==7511==WARNING: ASan doesn't fully support makecontext/swapcontext functions and may produce false positives in some cases!
PASS 74 ahci-test /x86_64/ahci/cdrom/pio/bcl
MALLOC_PERTURB_=${MALLOC_PERTURB_:-$(( ${RANDOM:-0} % 255 + 1))}  QTEST_QEMU_BINARY=x86_64-softmmu/qemu-system-x86_64 QTEST_QEMU_IMG=qemu-img tests/qtest/hd-geo-test -m=quick -k --tap < /dev/null | ./scripts/tap-driver.pl --test-name="hd-geo-test" 
PASS 1 hd-geo-test /x86_64/hd-geo/ide/none
==7525==WARNING: ASan doesn't fully support makecontext/swapcontext functions and may produce false positives in some cases!
PASS 2 hd-geo-test /x86_64/hd-geo/ide/drive/cd_0
==7531==WARNING: ASan doesn't fully support makecontext/swapcontext functions and may produce false positives in some cases!
PASS 3 hd-geo-test /x86_64/hd-geo/ide/drive/mbr/blank
==7537==WARNING: ASan doesn't fully support makecontext/swapcontext functions and may produce false positives in some cases!
PASS 4 hd-geo-test /x86_64/hd-geo/ide/drive/mbr/lba
==7543==WARNING: ASan doesn't fully support makecontext/swapcontext functions and may produce false positives in some cases!
PASS 5 hd-geo-test /x86_64/hd-geo/ide/drive/mbr/chs
==7549==WARNING: ASan doesn't fully support makecontext/swapcontext functions and may produce false positives in some cases!
PASS 6 hd-geo-test /x86_64/hd-geo/ide/device/mbr/blank
==7555==WARNING: ASan doesn't fully support makecontext/swapcontext functions and may produce false positives in some cases!
PASS 7 hd-geo-test /x86_64/hd-geo/ide/device/mbr/lba
==7561==WARNING: ASan doesn't fully support makecontext/swapcontext functions and may produce false positives in some cases!
PASS 8 hd-geo-test /x86_64/hd-geo/ide/device/mbr/chs
==7567==WARNING: ASan doesn't fully support makecontext/swapcontext functions and may produce false positives in some cases!
PASS 9 hd-geo-test /x86_64/hd-geo/ide/device/user/chs
==7572==WARNING: ASan doesn't fully support makecontext/swapcontext functions and may produce false positives in some cases!
PASS 10 hd-geo-test /x86_64/hd-geo/ide/device/user/chst
==7578==WARNING: ASan doesn't fully support makecontext/swapcontext functions and may produce false positives in some cases!
==7582==WARNING: ASan doesn't fully support makecontext/swapcontext functions and may produce false positives in some cases!
==7586==WARNING: ASan doesn't fully support makecontext/swapcontext functions and may produce false positives in some cases!
==7590==WARNING: ASan doesn't fully support makecontext/swapcontext functions and may produce false positives in some cases!
==7594==WARNING: ASan doesn't fully support makecontext/swapcontext functions and may produce false positives in some cases!
==7598==WARNING: ASan doesn't fully support makecontext/swapcontext functions and may produce false positives in some cases!
==7602==WARNING: ASan doesn't fully support makecontext/swapcontext functions and may produce false positives in some cases!
==7606==WARNING: ASan doesn't fully support makecontext/swapcontext functions and may produce false positives in some cases!
==7609==WARNING: ASan doesn't fully support makecontext/swapcontext functions and may produce false positives in some cases!
PASS 11 hd-geo-test /x86_64/hd-geo/override/ide
==7616==WARNING: ASan doesn't fully support makecontext/swapcontext functions and may produce false positives in some cases!
==7620==WARNING: ASan doesn't fully support makecontext/swapcontext functions and may produce false positives in some cases!
==7624==WARNING: ASan doesn't fully support makecontext/swapcontext functions and may produce false positives in some cases!
==7628==WARNING: ASan doesn't fully support makecontext/swapcontext functions and may produce false positives in some cases!
==7632==WARNING: ASan doesn't fully support makecontext/swapcontext functions and may produce false positives in some cases!
==7636==WARNING: ASan doesn't fully support makecontext/swapcontext functions and may produce false positives in some cases!
==7640==WARNING: ASan doesn't fully support makecontext/swapcontext functions and may produce false positives in some cases!
==7644==WARNING: ASan doesn't fully support makecontext/swapcontext functions and may produce false positives in some cases!
==7647==WARNING: ASan doesn't fully support makecontext/swapcontext functions and may produce false positives in some cases!
PASS 12 hd-geo-test /x86_64/hd-geo/override/scsi
==7654==WARNING: ASan doesn't fully support makecontext/swapcontext functions and may produce false positives in some cases!
==7658==WARNING: ASan doesn't fully support makecontext/swapcontext functions and may produce false positives in some cases!
==7662==WARNING: ASan doesn't fully support makecontext/swapcontext functions and may produce false positives in some cases!
==7666==WARNING: ASan doesn't fully support makecontext/swapcontext functions and may produce false positives in some cases!
==7670==WARNING: ASan doesn't fully support makecontext/swapcontext functions and may produce false positives in some cases!
==7674==WARNING: ASan doesn't fully support makecontext/swapcontext functions and may produce false positives in some cases!
==7678==WARNING: ASan doesn't fully support makecontext/swapcontext functions and may produce false positives in some cases!
==7682==WARNING: ASan doesn't fully support makecontext/swapcontext functions and may produce false positives in some cases!
==7685==WARNING: ASan doesn't fully support makecontext/swapcontext functions and may produce false positives in some cases!
PASS 13 hd-geo-test /x86_64/hd-geo/override/scsi_2_controllers
==7692==WARNING: ASan doesn't fully support makecontext/swapcontext functions and may produce false positives in some cases!
==7696==WARNING: ASan doesn't fully support makecontext/swapcontext functions and may produce false positives in some cases!
==7700==WARNING: ASan doesn't fully support makecontext/swapcontext functions and may produce false positives in some cases!
==7704==WARNING: ASan doesn't fully support makecontext/swapcontext functions and may produce false positives in some cases!
==7707==WARNING: ASan doesn't fully support makecontext/swapcontext functions and may produce false positives in some cases!
PASS 14 hd-geo-test /x86_64/hd-geo/override/virtio_blk
==7714==WARNING: ASan doesn't fully support makecontext/swapcontext functions and may produce false positives in some cases!
==7718==WARNING: ASan doesn't fully support makecontext/swapcontext functions and may produce false positives in some cases!
==7721==WARNING: ASan doesn't fully support makecontext/swapcontext functions and may produce false positives in some cases!
PASS 15 hd-geo-test /x86_64/hd-geo/override/zero_chs
==7728==WARNING: ASan doesn't fully support makecontext/swapcontext functions and may produce false positives in some cases!
==7732==WARNING: ASan doesn't fully support makecontext/swapcontext functions and may produce false positives in some cases!
==7736==WARNING: ASan doesn't fully support makecontext/swapcontext functions and may produce false positives in some cases!
==7740==WARNING: ASan doesn't fully support makecontext/swapcontext functions and may produce false positives in some cases!
==7743==WARNING: ASan doesn't fully support makecontext/swapcontext functions and may produce false positives in some cases!
PASS 16 hd-geo-test /x86_64/hd-geo/override/scsi_hot_unplug
==7750==WARNING: ASan doesn't fully support makecontext/swapcontext functions and may produce false positives in some cases!
==7754==WARNING: ASan doesn't fully support makecontext/swapcontext functions and may produce false positives in some cases!
==7758==WARNING: ASan doesn't fully support makecontext/swapcontext functions and may produce false positives in some cases!
==7762==WARNING: ASan doesn't fully support makecontext/swapcontext functions and may produce false positives in some cases!
==7765==WARNING: ASan doesn't fully support makecontext/swapcontext functions and may produce false positives in some cases!
PASS 17 hd-geo-test /x86_64/hd-geo/override/virtio_hot_unplug
MALLOC_PERTURB_=${MALLOC_PERTURB_:-$(( ${RANDOM:-0} % 255 + 1))}  QTEST_QEMU_BINARY=x86_64-softmmu/qemu-system-x86_64 QTEST_QEMU_IMG=qemu-img tests/qtest/boot-order-test -m=quick -k --tap < /dev/null | ./scripts/tap-driver.pl --test-name="boot-order-test" 
PASS 1 boot-order-test /x86_64/boot-order/pc
---
Could not access KVM kernel module: No such file or directory
qemu-system-x86_64: -accel kvm: failed to initialize kvm: No such file or directory
qemu-system-x86_64: falling back to tcg
==7834==WARNING: ASan doesn't fully support makecontext/swapcontext functions and may produce false positives in some cases!

Looking for expected file 'tests/data/acpi/pc/FACP'
Using expected file 'tests/data/acpi/pc/FACP'
---
Could not access KVM kernel module: No such file or directory
qemu-system-x86_64: -accel kvm: failed to initialize kvm: No such file or directory
qemu-system-x86_64: falling back to tcg
==7840==WARNING: ASan doesn't fully support makecontext/swapcontext functions and may produce false positives in some cases!

Looking for expected file 'tests/data/acpi/q35/FACP'
Using expected file 'tests/data/acpi/q35/FACP'
---
Could not access KVM kernel module: No such file or directory
qemu-system-x86_64: -accel kvm: failed to initialize kvm: No such file or directory
qemu-system-x86_64: falling back to tcg
==7846==WARNING: ASan doesn't fully support makecontext/swapcontext functions and may produce false positives in some cases!

Looking for expected file 'tests/data/acpi/pc/FACP.bridge'
Looking for expected file 'tests/data/acpi/pc/FACP'
---
Could not access KVM kernel module: No such file or directory
qemu-system-x86_64: -accel kvm: failed to initialize kvm: No such file or directory
qemu-system-x86_64: falling back to tcg
==7852==WARNING: ASan doesn't fully support makecontext/swapcontext functions and may produce false positives in some cases!

Looking for expected file 'tests/data/acpi/pc/FACP.ipmikcs'
Looking for expected file 'tests/data/acpi/pc/FACP'
---
Could not access KVM kernel module: No such file or directory
qemu-system-x86_64: -accel kvm: failed to initialize kvm: No such file or directory
qemu-system-x86_64: falling back to tcg
==7858==WARNING: ASan doesn't fully support makecontext/swapcontext functions and may produce false positives in some cases!

Looking for expected file 'tests/data/acpi/pc/FACP.cphp'
Looking for expected file 'tests/data/acpi/pc/FACP'
---
Could not access KVM kernel module: No such file or directory
qemu-system-x86_64: -accel kvm: failed to initialize kvm: No such file or directory
qemu-system-x86_64: falling back to tcg
==7865==WARNING: ASan doesn't fully support makecontext/swapcontext functions and may produce false positives in some cases!

Looking for expected file 'tests/data/acpi/pc/FACP.memhp'
Looking for expected file 'tests/data/acpi/pc/FACP'
---
Could not access KVM kernel module: No such file or directory
qemu-system-x86_64: -accel kvm: failed to initialize kvm: No such file or directory
qemu-system-x86_64: falling back to tcg
==7871==WARNING: ASan doesn't fully support makecontext/swapcontext functions and may produce false positives in some cases!

Looking for expected file 'tests/data/acpi/pc/FACP.numamem'
Looking for expected file 'tests/data/acpi/pc/FACP'
---
Could not access KVM kernel module: No such file or directory
qemu-system-x86_64: -accel kvm: failed to initialize kvm: No such file or directory
qemu-system-x86_64: falling back to tcg
==7877==WARNING: ASan doesn't fully support makecontext/swapcontext functions and may produce false positives in some cases!

Looking for expected file 'tests/data/acpi/pc/FACP.dimmpxm'
Looking for expected file 'tests/data/acpi/pc/FACP'
---
Could not access KVM kernel module: No such file or directory
qemu-system-x86_64: -accel kvm: failed to initialize kvm: No such file or directory
qemu-system-x86_64: falling back to tcg
==7886==WARNING: ASan doesn't fully support makecontext/swapcontext functions and may produce false positives in some cases!

Looking for expected file 'tests/data/acpi/pc/FACP.acpihmat'
Looking for expected file 'tests/data/acpi/pc/FACP'
---
Could not access KVM kernel module: No such file or directory
qemu-system-x86_64: -accel kvm: failed to initialize kvm: No such file or directory
qemu-system-x86_64: falling back to tcg
==7893==WARNING: ASan doesn't fully support makecontext/swapcontext functions and may produce false positives in some cases!

Looking for expected file 'tests/data/acpi/q35/FACP.bridge'
Looking for expected file 'tests/data/acpi/q35/FACP'
---
Could not access KVM kernel module: No such file or directory
qemu-system-x86_64: -accel kvm: failed to initialize kvm: No such file or directory
qemu-system-x86_64: falling back to tcg
==7899==WARNING: ASan doesn't fully support makecontext/swapcontext functions and may produce false positives in some cases!

Looking for expected file 'tests/data/acpi/q35/FACP.mmio64'
Looking for expected file 'tests/data/acpi/q35/FACP'
---
Could not access KVM kernel module: No such file or directory
qemu-system-x86_64: -accel kvm: failed to initialize kvm: No such file or directory
qemu-system-x86_64: falling back to tcg
==7905==WARNING: ASan doesn't fully support makecontext/swapcontext functions and may produce false positives in some cases!

Looking for expected file 'tests/data/acpi/q35/FACP.ipmibt'
Looking for expected file 'tests/data/acpi/q35/FACP'
---
Could not access KVM kernel module: No such file or directory
qemu-system-x86_64: -accel kvm: failed to initialize kvm: No such file or directory
qemu-system-x86_64: falling back to tcg
==7911==WARNING: ASan doesn't fully support makecontext/swapcontext functions and may produce false positives in some cases!

Looking for expected file 'tests/data/acpi/q35/FACP.cphp'
Looking for expected file 'tests/data/acpi/q35/FACP'
---
Could not access KVM kernel module: No such file or directory
qemu-system-x86_64: -accel kvm: failed to initialize kvm: No such file or directory
qemu-system-x86_64: falling back to tcg
==7918==WARNING: ASan doesn't fully support makecontext/swapcontext functions and may produce false positives in some cases!

Looking for expected file 'tests/data/acpi/q35/FACP.memhp'
Looking for expected file 'tests/data/acpi/q35/FACP'
---
Could not access KVM kernel module: No such file or directory
qemu-system-x86_64: -accel kvm: failed to initialize kvm: No such file or directory
qemu-system-x86_64: falling back to tcg
==7924==WARNING: ASan doesn't fully support makecontext/swapcontext functions and may produce false positives in some cases!

Looking for expected file 'tests/data/acpi/q35/FACP.numamem'
Looking for expected file 'tests/data/acpi/q35/FACP'
---
Could not access KVM kernel module: No such file or directory
qemu-system-x86_64: -accel kvm: failed to initialize kvm: No such file or directory
qemu-system-x86_64: falling back to tcg
==7930==WARNING: ASan doesn't fully support makecontext/swapcontext functions and may produce false positives in some cases!

Looking for expected file 'tests/data/acpi/q35/FACP.dimmpxm'
Looking for expected file 'tests/data/acpi/q35/FACP'
---
Could not access KVM kernel module: No such file or directory
qemu-system-x86_64: -accel kvm: failed to initialize kvm: No such file or directory
qemu-system-x86_64: falling back to tcg
==7939==WARNING: ASan doesn't fully support makecontext/swapcontext functions and may produce false positives in some cases!

Looking for expected file 'tests/data/acpi/q35/FACP.acpihmat'
Looking for expected file 'tests/data/acpi/q35/FACP'
---
PASS 1 i440fx-test /x86_64/i440fx/defaults
PASS 2 i440fx-test /x86_64/i440fx/pam
PASS 3 i440fx-test /x86_64/i440fx/firmware/bios
==8031==WARNING: ASan doesn't fully support makecontext/swapcontext functions and may produce false positives in some cases!
PASS 4 i440fx-test /x86_64/i440fx/firmware/pflash
MALLOC_PERTURB_=${MALLOC_PERTURB_:-$(( ${RANDOM:-0} % 255 + 1))}  QTEST_QEMU_BINARY=x86_64-softmmu/qemu-system-x86_64 QTEST_QEMU_IMG=qemu-img tests/qtest/fw_cfg-test -m=quick -k --tap < /dev/null | ./scripts/tap-driver.pl --test-name="fw_cfg-test" 
PASS 1 fw_cfg-test /x86_64/fw_cfg/signature
---
MALLOC_PERTURB_=${MALLOC_PERTURB_:-$(( ${RANDOM:-0} % 255 + 1))}  QTEST_QEMU_BINARY=x86_64-softmmu/qemu-system-x86_64 QTEST_QEMU_IMG=qemu-img tests/qtest/drive_del-test -m=quick -k --tap < /dev/null | ./scripts/tap-driver.pl --test-name="drive_del-test" 
PASS 1 drive_del-test /x86_64/drive_del/without-dev
PASS 2 drive_del-test /x86_64/drive_del/after_failed_device_add
==8124==WARNING: ASan doesn't fully support makecontext/swapcontext functions and may produce false positives in some cases!
PASS 3 drive_del-test /x86_64/blockdev/drive_del_device_del
MALLOC_PERTURB_=${MALLOC_PERTURB_:-$(( ${RANDOM:-0} % 255 + 1))}  QTEST_QEMU_BINARY=x86_64-softmmu/qemu-system-x86_64 QTEST_QEMU_IMG=qemu-img tests/qtest/wdt_ib700-test -m=quick -k --tap < /dev/null | ./scripts/tap-driver.pl --test-name="wdt_ib700-test" 
PASS 1 wdt_ib700-test /x86_64/wdt_ib700/pause
---
PASS 1 usb-hcd-uhci-test /x86_64/uhci/pci/init
PASS 2 usb-hcd-uhci-test /x86_64/uhci/pci/port1
PASS 3 usb-hcd-uhci-test /x86_64/uhci/pci/hotplug
==8319==WARNING: ASan doesn't fully support makecontext/swapcontext functions and may produce false positives in some cases!
PASS 4 usb-hcd-uhci-test /x86_64/uhci/pci/hotplug/usb-storage
MALLOC_PERTURB_=${MALLOC_PERTURB_:-$(( ${RANDOM:-0} % 255 + 1))}  QTEST_QEMU_BINARY=x86_64-softmmu/qemu-system-x86_64 QTEST_QEMU_IMG=qemu-img tests/qtest/usb-hcd-ehci-test -m=quick -k --tap < /dev/null | ./scripts/tap-driver.pl --test-name="usb-hcd-ehci-test" 
PASS 1 usb-hcd-ehci-test /x86_64/ehci/pci/uhci-port-1
---
MALLOC_PERTURB_=${MALLOC_PERTURB_:-$(( ${RANDOM:-0} % 255 + 1))}  QTEST_QEMU_BINARY=x86_64-softmmu/qemu-system-x86_64 QTEST_QEMU_IMG=qemu-img tests/qtest/usb-hcd-xhci-test -m=quick -k --tap < /dev/null | ./scripts/tap-driver.pl --test-name="usb-hcd-xhci-test" 
PASS 1 usb-hcd-xhci-test /x86_64/xhci/pci/init
PASS 2 usb-hcd-xhci-test /x86_64/xhci/pci/hotplug
==8337==WARNING: ASan doesn't fully support makecontext/swapcontext functions and may produce false positives in some cases!
PASS 3 usb-hcd-xhci-test /x86_64/xhci/pci/hotplug/usb-uas
PASS 4 usb-hcd-xhci-test /x86_64/xhci/pci/hotplug/usb-ccid
MALLOC_PERTURB_=${MALLOC_PERTURB_:-$(( ${RANDOM:-0} % 255 + 1))}  QTEST_QEMU_BINARY=x86_64-softmmu/qemu-system-x86_64 QTEST_QEMU_IMG=qemu-img tests/qtest/cpu-plug-test -m=quick -k --tap < /dev/null | ./scripts/tap-driver.pl --test-name="cpu-plug-test" 
---
Could not access KVM kernel module: No such file or directory
qemu-system-x86_64: -accel kvm: failed to initialize kvm: No such file or directory
qemu-system-x86_64: falling back to tcg
==8473==WARNING: ASan doesn't fully support makecontext/swapcontext functions and may produce false positives in some cases!
PASS 1 vmgenid-test /x86_64/vmgenid/vmgenid/set-guid
Could not access KVM kernel module: No such file or directory
qemu-system-x86_64: -accel kvm: failed to initialize kvm: No such file or directory
qemu-system-x86_64: falling back to tcg
==8479==WARNING: ASan doesn't fully support makecontext/swapcontext functions and may produce false positives in some cases!
PASS 2 vmgenid-test /x86_64/vmgenid/vmgenid/set-guid-auto
Could not access KVM kernel module: No such file or directory
qemu-system-x86_64: -accel kvm: failed to initialize kvm: No such file or directory
qemu-system-x86_64: falling back to tcg
==8485==WARNING: ASan doesn't fully support makecontext/swapcontext functions and may produce false positives in some cases!
PASS 3 vmgenid-test /x86_64/vmgenid/vmgenid/query-monitor
MALLOC_PERTURB_=${MALLOC_PERTURB_:-$(( ${RANDOM:-0} % 255 + 1))}  QTEST_QEMU_BINARY=x86_64-softmmu/qemu-system-x86_64 QTEST_QEMU_IMG=qemu-img tests/qtest/tpm-crb-swtpm-test -m=quick -k --tap < /dev/null | ./scripts/tap-driver.pl --test-name="tpm-crb-swtpm-test" 
SKIP 1 tpm-crb-swtpm-test /x86_64/tpm/crb-swtpm/test # SKIP swtpm not in PATH or missing --tpm2 support
---
Could not access KVM kernel module: No such file or directory
qemu-system-x86_64: -accel kvm: failed to initialize kvm: No such file or directory
qemu-system-x86_64: falling back to tcg
==8584==WARNING: ASan doesn't fully support makecontext/swapcontext functions and may produce false positives in some cases!
Could not access KVM kernel module: No such file or directory
qemu-system-x86_64: -accel kvm: failed to initialize kvm: No such file or directory
qemu-system-x86_64: falling back to tcg
==8590==WARNING: ASan doesn't fully support makecontext/swapcontext functions and may produce false positives in some cases!
PASS 3 migration-test /x86_64/migration/fd_proto
Could not access KVM kernel module: No such file or directory
qemu-system-x86_64: -accel kvm: failed to initialize kvm: No such file or directory
qemu-system-x86_64: falling back to tcg
==8597==WARNING: ASan doesn't fully support makecontext/swapcontext functions and may produce false positives in some cases!
Could not access KVM kernel module: No such file or directory
qemu-system-x86_64: -accel kvm: failed to initialize kvm: No such file or directory
qemu-system-x86_64: falling back to tcg
==8603==WARNING: ASan doesn't fully support makecontext/swapcontext functions and may produce false positives in some cases!
PASS 4 migration-test /x86_64/migration/validate_uuid
PASS 5 migration-test /x86_64/migration/validate_uuid_error
PASS 6 migration-test /x86_64/migration/validate_uuid_src_not_set
---
Could not access KVM kernel module: No such file or directory
qemu-system-x86_64: -accel kvm: failed to initialize kvm: No such file or directory
qemu-system-x86_64: falling back to tcg
==8653==WARNING: ASan doesn't fully support makecontext/swapcontext functions and may produce false positives in some cases!
Could not access KVM kernel module: No such file or directory
qemu-system-x86_64: -accel kvm: failed to initialize kvm: No such file or directory
qemu-system-x86_64: falling back to tcg
==8659==WARNING: ASan doesn't fully support makecontext/swapcontext functions and may produce false positives in some cases!
PASS 8 migration-test /x86_64/migration/auto_converge
Could not access KVM kernel module: No such file or directory
qemu-system-x86_64: -accel kvm: failed to initialize kvm: No such file or directory
qemu-system-x86_64: falling back to tcg
==8667==WARNING: ASan doesn't fully support makecontext/swapcontext functions and may produce false positives in some cases!
Could not access KVM kernel module: No such file or directory
qemu-system-x86_64: -accel kvm: failed to initialize kvm: No such file or directory
qemu-system-x86_64: falling back to tcg
==8673==WARNING: ASan doesn't fully support makecontext/swapcontext functions and may produce false positives in some cases!
PASS 9 migration-test /x86_64/migration/postcopy/unix
PASS 10 migration-test /x86_64/migration/postcopy/recovery
Could not access KVM kernel module: No such file or directory
qemu-system-x86_64: -accel kvm: failed to initialize kvm: No such file or directory
qemu-system-x86_64: falling back to tcg
==8702==WARNING: ASan doesn't fully support makecontext/swapcontext functions and may produce false positives in some cases!
Could not access KVM kernel module: No such file or directory
qemu-system-x86_64: -accel kvm: failed to initialize kvm: No such file or directory
qemu-system-x86_64: falling back to tcg
==8708==WARNING: ASan doesn't fully support makecontext/swapcontext functions and may produce false positives in some cases!
PASS 11 migration-test /x86_64/migration/precopy/unix
Could not access KVM kernel module: No such file or directory
qemu-system-x86_64: -accel kvm: failed to initialize kvm: No such file or directory
qemu-system-x86_64: falling back to tcg
==8716==WARNING: ASan doesn't fully support makecontext/swapcontext functions and may produce false positives in some cases!
Could not access KVM kernel module: No such file or directory
qemu-system-x86_64: -accel kvm: failed to initialize kvm: No such file or directory
qemu-system-x86_64: falling back to tcg
==8722==WARNING: ASan doesn't fully support makecontext/swapcontext functions and may produce false positives in some cases!
PASS 12 migration-test /x86_64/migration/precopy/tcp
Could not access KVM kernel module: No such file or directory
qemu-system-x86_64: -accel kvm: failed to initialize kvm: No such file or directory
qemu-system-x86_64: falling back to tcg
==8730==WARNING: ASan doesn't fully support makecontext/swapcontext functions and may produce false positives in some cases!
Could not access KVM kernel module: No such file or directory
qemu-system-x86_64: -accel kvm: failed to initialize kvm: No such file or directory
qemu-system-x86_64: falling back to tcg
==8736==WARNING: ASan doesn't fully support makecontext/swapcontext functions and may produce false positives in some cases!
PASS 13 migration-test /x86_64/migration/xbzrle/unix
Could not access KVM kernel module: No such file or directory
qemu-system-x86_64: -accel kvm: failed to initialize kvm: No such file or directory
qemu-system-x86_64: falling back to tcg
==8744==WARNING: ASan doesn't fully support makecontext/swapcontext functions and may produce false positives in some cases!
Could not access KVM kernel module: No such file or directory
qemu-system-x86_64: -accel kvm: failed to initialize kvm: No such file or directory
qemu-system-x86_64: falling back to tcg
==8750==WARNING: ASan doesn't fully support makecontext/swapcontext functions and may produce false positives in some cases!
PASS 14 migration-test /x86_64/migration/multifd/tcp/none
Could not access KVM kernel module: No such file or directory
qemu-system-x86_64: -accel kvm: failed to initialize kvm: No such file or directory
qemu-system-x86_64: falling back to tcg
==8868==WARNING: ASan doesn't fully support makecontext/swapcontext functions and may produce false positives in some cases!
PASS 15 migration-test /x86_64/migration/multifd/tcp/cancel
Could not access KVM kernel module: No such file or directory
qemu-system-x86_64: -accel kvm: failed to initialize kvm: No such file or directory
qemu-system-x86_64: falling back to tcg
==8924==WARNING: ASan doesn't fully support makecontext/swapcontext functions and may produce false positives in some cases!
Could not access KVM kernel module: No such file or directory
qemu-system-x86_64: -accel kvm: failed to initialize kvm: No such file or directory
qemu-system-x86_64: falling back to tcg
==8930==WARNING: ASan doesn't fully support makecontext/swapcontext functions and may produce false positives in some cases!
PASS 16 migration-test /x86_64/migration/multifd/tcp/zlib
Could not access KVM kernel module: No such file or directory
qemu-system-x86_64: -accel kvm: failed to initialize kvm: No such file or directory
qemu-system-x86_64: falling back to tcg
==8986==WARNING: ASan doesn't fully support makecontext/swapcontext functions and may produce false positives in some cases!
Could not access KVM kernel module: No such file or directory
qemu-system-x86_64: -accel kvm: failed to initialize kvm: No such file or directory
qemu-system-x86_64: falling back to tcg
==8992==WARNING: ASan doesn't fully support makecontext/swapcontext functions and may produce false positives in some cases!
PASS 17 migration-test /x86_64/migration/multifd/tcp/zstd
MALLOC_PERTURB_=${MALLOC_PERTURB_:-$(( ${RANDOM:-0} % 255 + 1))}  QTEST_QEMU_BINARY=x86_64-softmmu/qemu-system-x86_64 QTEST_QEMU_IMG=qemu-img tests/qtest/test-x86-cpuid-compat -m=quick -k --tap < /dev/null | ./scripts/tap-driver.pl --test-name="test-x86-cpuid-compat" 
PASS 1 test-x86-cpuid-compat /x86/cpuid/parsing-plus-minus
---
PASS 1 machine-none-test /x86_64/machine/none/cpu_option
MALLOC_PERTURB_=${MALLOC_PERTURB_:-$(( ${RANDOM:-0} % 255 + 1))}  QTEST_QEMU_BINARY=x86_64-softmmu/qemu-system-x86_64 QTEST_QEMU_IMG=qemu-img tests/qtest/qmp-test -m=quick -k --tap < /dev/null | ./scripts/tap-driver.pl --test-name="qmp-test" 
PASS 1 qmp-test /x86_64/qmp/protocol
==9430==WARNING: ASan doesn't fully support makecontext/swapcontext functions and may produce false positives in some cases!
PASS 2 qmp-test /x86_64/qmp/oob
PASS 3 qmp-test /x86_64/qmp/preconfig
PASS 4 qmp-test /x86_64/qmp/missing-any-arg
---
qemu-system-x86_64: The -accel and "-machine accel=" options are incompatible
socket_accept failed: Resource temporarily unavailable
**
ERROR:/tmp/qemu-test/src/tests/qtest/libqtest.c:301:qtest_init_without_qmp_handshake: assertion failed: (s->fd >= 0 && s->qmp_fd >= 0)
/tmp/qemu-test/src/tests/qtest/libqtest.c:166: kill_qemu() tried to terminate QEMU process but encountered exit status 1 (expected 0)
ERROR - Bail out! ERROR:/tmp/qemu-test/src/tests/qtest/libqtest.c:301:qtest_init_without_qmp_handshake: assertion failed: (s->fd >= 0 && s->qmp_fd >= 0)
make: *** [/tmp/qemu-test/src/tests/Makefile.include:636: check-qtest-x86_64] Error 1
Traceback (most recent call last):
  File "./tests/docker/docker.py", line 664, in <module>
    sys.exit(main())
---
    raise CalledProcessError(retcode, cmd)
subprocess.CalledProcessError: Command '['sudo', '-n', 'docker', 'run', '--label', 'com.qemu.instance.uuid=8c2b0ec405f440699d09a8d8445e6898', '-u', '1003', '--security-opt', 'seccomp=unconfined', '--rm', '-e', 'TARGET_LIST=x86_64-softmmu', '-e', 'EXTRA_CONFIGURE_OPTS=', '-e', 'V=', '-e', 'J=14', '-e', 'DEBUG=', '-e', 'SHOW_ENV=', '-e', 'CCACHE_DIR=/var/tmp/ccache', '-v', '/home/patchew2/.cache/qemu-docker-ccache:/var/tmp/ccache:z', '-v', '/var/tmp/patchew-tester-tmp-3qzsux3_/src/docker-src.2020-03-25-02.51.29.5010:/var/tmp/qemu:z,ro', 'qemu:fedora', '/var/tmp/qemu/run', 'test-debug']' returned non-zero exit status 2.
filter=--filter=label=com.qemu.instance.uuid=8c2b0ec405f440699d09a8d8445e6898
make[1]: *** [docker-run] Error 1
make[1]: Leaving directory `/var/tmp/patchew-tester-tmp-3qzsux3_/src'
make: *** [docker-run-test-debug@fedora] Error 2

real    34m15.350s
user    0m8.787s


The full log is available at
http://patchew.org/logs/20200325064736.22416-1-olaf@aepfle.de/testing.asan/?type=message.
---
Email generated automatically by Patchew [https://patchew.org/].
Please send your feedback to patchew-devel@redhat.com

Re: [PATCH v3] piix: fix xenfv regression, add compat machine xenfv-qemu4

Posted by no-reply@patchew.org 1 week ago
Patchew URL: https://patchew.org/QEMU/20200325064736.22416-1-olaf@aepfle.de/



Hi,

This series failed the docker-quick@centos7 build test. Please find the testing commands and
their output below. If you have Docker installed, you can probably reproduce it
locally.

=== TEST SCRIPT BEGIN ===
#!/bin/bash
make docker-image-centos7 V=1 NETWORK=1
time make docker-test-quick@centos7 SHOW_ENV=1 J=14 NETWORK=1
=== TEST SCRIPT END ===

  TEST    iotest-qcow2: 184
socket_accept failed: Resource temporarily unavailable
**
ERROR:/tmp/qemu-test/src/tests/qtest/libqtest.c:301:qtest_init_without_qmp_handshake: assertion failed: (s->fd >= 0 && s->qmp_fd >= 0)
/tmp/qemu-test/src/tests/qtest/libqtest.c:166: kill_qemu() tried to terminate QEMU process but encountered exit status 1 (expected 0)
ERROR - Bail out! ERROR:/tmp/qemu-test/src/tests/qtest/libqtest.c:301:qtest_init_without_qmp_handshake: assertion failed: (s->fd >= 0 && s->qmp_fd >= 0)
make: *** [check-qtest-x86_64] Error 1
make: *** Waiting for unfinished jobs....
  TEST    iotest-qcow2: 186
  TEST    iotest-qcow2: 187
---
    raise CalledProcessError(retcode, cmd)
subprocess.CalledProcessError: Command '['sudo', '-n', 'docker', 'run', '--label', 'com.qemu.instance.uuid=0c126babd05d4024b8e204c8c505e6ae', '-u', '1001', '--security-opt', 'seccomp=unconfined', '--rm', '-e', 'TARGET_LIST=', '-e', 'EXTRA_CONFIGURE_OPTS=', '-e', 'V=', '-e', 'J=14', '-e', 'DEBUG=', '-e', 'SHOW_ENV=1', '-e', 'CCACHE_DIR=/var/tmp/ccache', '-v', '/home/patchew/.cache/qemu-docker-ccache:/var/tmp/ccache:z', '-v', '/var/tmp/patchew-tester-tmp-vtab314m/src/docker-src.2020-03-25-02.59.25.14714:/var/tmp/qemu:z,ro', 'qemu:centos7', '/var/tmp/qemu/run', 'test-quick']' returned non-zero exit status 2.
filter=--filter=label=com.qemu.instance.uuid=0c126babd05d4024b8e204c8c505e6ae
make[1]: *** [docker-run] Error 1
make[1]: Leaving directory `/var/tmp/patchew-tester-tmp-vtab314m/src'
make: *** [docker-run-test-quick@centos7] Error 2

real    11m43.193s
user    0m8.444s


The full log is available at
http://patchew.org/logs/20200325064736.22416-1-olaf@aepfle.de/testing.docker-quick@centos7/?type=message.
---
Email generated automatically by Patchew [https://patchew.org/].
Please send your feedback to patchew-devel@redhat.com